program: Gaussian 09
title: 000264786
version: EM64L-G09RevD.01
frameworkgroup: C1[X(C5H6N4S3)]
method: RPBEPBE
basis: SDD
operation: Freq
keyword: #pfreq=noraman
keyword: PBEPBE/SDD
title: #p freq=noraman PBEPBE/SDD
converged: NO NO NO NO
title: Mulliken charges:
elementType: S S S N N N N C C C C C H H H H H H
charge: 0.327105 0.284677 0.318668 -0.235385 0.080566 -0.065671 -0.105088 -0.109184 -0.103591 -0.425216 -0.813502 -0.818400 0.243723 0.290872 0.291671 0.255561 0.291654 0.291540
chargesum: 0.00000
title: Mulliken charges with hydrogens summed into heavy atoms:
elementType: S S S N N N N C C C C C
charge: 0.327105 0.284677 0.318668 -0.235385 0.080566 -0.065671 -0.105088 -0.109184 -0.103591 -0.425216 0.012764 0.020354
polarizability: 2.02194287e+02 2.05847852e+00 1.45649350e+02 3.31947440e-02 4.69614292e-02 5.66193622e+01
1716.lowfreq: -8.6065 -3.8001 -0.0004 0.0012 0.0019 1.7589 45.0587 52.5699 91.1626
frequency: 45.0522 52.5037 91.1533 99.6505 108.5830 128.8283 141.3784 161.7567 224.7020 269.1366 271.7418 325.5121 378.3633 407.5361 467.3675 523.6504 565.4799 611.1986 618.3800 641.1574 648.3798 658.3133 740.0863 892.9055 895.1851 969.2497 981.2552 984.9975 1001.3734 1006.4266 1129.3858 1200.5489 1280.8939 1344.2806 1348.9288 1381.3496 1400.6228 1434.8119 1435.6428 1445.2545 1453.1453 1461.9613 3031.3929 3031.6024 3161.4228 3161.9023 3163.8997 3164.7090
redmass: 3.5885 3.9048 4.9097 3.0896 1.4886 1.4277 2.6893 3.8929 4.2134 9.1379 12.2308 12.4974 16.2332 14.9056 11.6949 12.8808 15.1519 13.1216 10.8840 7.6261 7.9506 12.8260 13.5473 12.9977 13.2641 5.7994 1.1748 1.1754 1.2826 1.4186 12.0027 12.9550 10.3487 1.1777 1.2037 7.2681 10.2099 1.0519 1.0510 1.4213 1.0578 2.9995 1.0275 1.0276 1.1052 1.1052 1.1064 1.1066
irintensity: 3.4068 1.1390 1.2967 3.3215 0.1480 0.9435 0.0962 6.6582 6.8353 1.6441 0.2360 2.6986 0.1014 0.0408 0.6924 0.0942 1.6077 0.2591 9.2806 4.3409 8.5843 0.1148 20.1197 81.1815 17.7379 39.9709 6.9219 7.4417 3.2101 24.5077 10.4793 22.3865 32.8432 20.4052 1.1642 9.6037 254.4422 15.9915 16.7008 8.2701 26.9823 51.4135 10.2765 17.2271 6.0868 3.7925 7.0590 6.3810
temp: 298.150 k
press: 1.00000 atm
elementType: 16 16 16 7 7 7 7 6 6 6 6 6 1 1 1 1 1 1
symmnumber: 1
zpe: 298725.8 jmol-1
zpe.correction: 0.113779 hartree
zpe.thermalcorrener: 0.126778 hartree
zpe.thermalcorrenthalpy: 0.127722 hartree
zpe.thermalcorrgfe: 0.072513 hartree
zpe.sumelectzpe: -1606.344704 hartree
zpe.sumelectthermal: -1606.331705 hartree
zpe.sumelectthermalent: -1606.330760 hartree
zpe.sumelectthermalfe: -1606.385969 hartree
dipole: -2.3492 -4.5193 0.0135
dipole: 5.0934
quadrupole: -79.1465 -95.6088 -93.5027
quadrupole: -3.3502 0.0870 0.0088
quadrupole: 10.2729 -6.1895 -4.0834 -3.3502 0.0870 0.0088
hfenergy: -1606.4584823 hartree
pointgroup: C01 [X(C5H6N4S3)]
dipole: -1.1559199 1.5933293 0.3752507 debye
dipolederiv: -0.4085693 0.0855818 0.0498161 0.0849076 -0.1930876 -0.0770505 0.0498627 -0.0772758 0.1548794 -0.1987934 -0.1205413 -0.0135561 -0.3792314 -0.2589623 -0.0236034 -0.0668201 -0.0406494 -0.0273623 -0.474851 0.2381617 0.0745273 0.2827839 -0.1680236 -0.0493393 0.082441 -0.0464528 -0.013293 -0.5529096 -0.0418314 0.0270623 0.3304229 -0.2708075 -0.0852837 0.1018975 -0.0635618 0.0498257 -0.4610274 -0.0781457 0.0078726 -0.59608 -0.4919733 -0.0525201 -0.0955159 -0.0822167 -0.0662989 -0.7470655 -0.2291749 -0.0128074 -0.0347314 -0.19966 -0.0025012 0.0254228 0.0081769 -0.1750882 -0.3361053 0.2324356 0.0525832 0.0227592 -0.3272351 -0.0223351 0.0103344 -0.0353419 -0.2270729 0.8899835 0.1161624 -0.0273682 -0.3836912 -0.0141352 0.0201804 -0.1265332 -0.0080903 0.0001484 0.6952377 0.2639943 0.014219 0.7576837 0.7530883 0.1004404 0.1119256 0.1294178 0.0385265 1.1708864 -0.3427852 -0.141345 -0.1676132 0.7754098 0.1864865 -0.1061837 0.196708 -0.0776074 0.3038686 0.0412446 -0.0095067 0.0049541 0.0173681 -0.0053534 -0.0159049 -0.0064985 0.0451262 -0.032508 -0.0402328 -0.0032985 -0.102442 0.2350894 0.0429537 -0.015278 0.0391685 0.0595694 0.0111068 -0.0706656 -0.006656 -0.1044528 -0.0483461 -0.0308556 -0.0128839 -0.032331 0.1256054 0.0040058 -0.0050191 0.0269534 0.084599 0.1062446 -0.0674236 0.027735 -0.0374353 -0.0379103 0.0019601 0.0143274 -0.0252782 0.0996634 0.0494771 0.0907834 0.0096779 0.0718596 0.0260155 -0.049657 0.062696 0.0226918 0.0762401 0.0471884 -0.0221706 0.0255541 -0.0214329 0.1308271 0.1003183 -0.0787048 0.0644923 0.0010192 -0.015689 0.0313375 0.0606137 0.0201929 -0.0007757 0.0841194 -0.0475029 -0.1004021 0.0232092 0.0040541 -0.0337455 -0.0663447 -0.0142372 -0.0051149 unknown
polarizability: 201.2402998|7.1063039|142.9084465|-6.9388843|16.6569762|60.3142538 unknown
InChI: InChI=1S/C5H6N4S3/c1-10-3-6-7-4-9(3)8-5(11-2)12-4/h1-2H3
charge 0 multiplicity 1
18 atoms
S  -1.541224 -2.141601 -0.225342
S  2.124165 1.843017 0.355904
S  -3.729227 0.044032 0.329499
N  0.202383 -0.189369 0.063183
N  -1.002011 0.495343 0.265721
N  1.408023 -2.062413 -0.375233
N  2.296208 -0.929462 -0.20129
C  0.175412 -1.570036 -0.208418
C  1.543945 0.172246 0.058541
C  -1.996924 -0.371453 0.149842
C  3.972499 1.497018 0.166892
C  -3.555402 1.891448 0.689969
H  4.466013 2.465508 0.335817
H  4.171165 1.118971 -0.844967
H  4.282585 0.754994 0.914805
H  -4.585431 2.254835 0.819009
H  -3.064161 2.384494 -0.159791
H  -2.967819 2.030527 1.60756
