program: Gaussian 09
title: 000024468
version: EM64L-G09RevD.01
frameworkgroup: C1[X(C16H18O3)]
method: RPBEPBE
basis: SDD
operation: Freq
keyword: #pfreq=noraman
keyword: PBEPBE/SDD
title: #p freq=noraman PBEPBE/SDD
converged: YES YES NO NO
title: Mulliken charges:
elementType: O O O C C C C C C C C C C C C C C C C H H H H H H H H H H H H H H H H H H
charge: -0.293512 -0.458607 -0.230076 -0.058131 0.156615 -0.316560 0.271307 0.216225 -0.360337 0.188567 -0.386846 -0.388933 -0.393151 -0.362302 -0.694527 -0.235683 -0.263343 0.083529 -0.791775 0.197795 0.227908 0.213494 0.212488 0.188308 0.254505 0.275664 0.263737 0.249289 0.253541 0.201940 0.214926 0.233407 0.230241 0.355668 0.259890 0.248122 0.236618
chargesum: 0.00000
title: Mulliken charges with hydrogens summed into heavy atoms:
elementType: O O O C C C C C C C C C C C C C C C C
charge: -0.293512 -0.102940 -0.230076 0.139664 0.156615 0.124842 0.271307 0.216225 0.040459 0.188567 -0.132342 -0.113269 -0.129414 -0.113012 -0.024120 -0.002276 -0.033102 0.083529 -0.047144
polarizability: 2.68711260e+02 -2.33872920e+00 2.18124200e+02 6.26294305e+00 1.84180878e+00 1.00242396e+02
1716.lowfreq: -0.0004 0.0002 0.0004 4.2422 7.4101 12.1520 27.7540 46.2913 53.5088
frequency: 27.7230 46.2106 53.5082 56.2593 82.6720 95.4278 121.9159 150.3511 168.0234 185.8503 194.6522 213.3716 221.9662 231.2665 281.1425 292.8627 341.4724 364.6306 403.8112 415.9842 422.3674 448.8131 470.2412 485.2211 497.8954 520.7527 550.1869 590.8064 600.9391 631.7978 659.1201 672.0160 724.7002 769.2587 777.5385 785.9373 794.9462 830.8449 856.2682 881.3359 908.3525 927.3602 954.9136 966.5221 970.9621 984.3250 987.5254 997.7567 1020.7373 1035.7348 1041.5804 1062.1500 1070.4923 1110.6550 1112.0185 1134.1823 1159.7879 1179.2182 1198.7759 1204.0083 1230.6743 1243.6798 1254.8417 1276.8967 1290.2383 1291.1942 1342.4121 1356.4836 1360.4634 1371.3742 1384.1259 1388.1177 1398.3046 1411.0873 1437.0778 1445.7163 1451.4228 1456.4418 1462.3285 1465.0081 1473.5087 1489.2935 1522.3667 1549.0950 1579.7779 1595.7836 1627.0489 2947.8642 2971.2432 2982.6323 2985.2434 2985.7242 3037.0614 3049.4055 3077.3179 3078.1778 3102.6978 3116.2727 3133.3220 3150.8725 3152.0026 3171.7947 3174.2331 3194.7921 3547.6984
redmass: 4.2636 3.4941 4.2900 3.9774 3.5256 3.5864 2.8730 4.4114 3.7972 3.4911 3.4145 1.7835 1.4091 1.5590 2.9984 4.5299 6.2338 4.1533 2.5565 1.4556 3.2197 2.4322 3.3391 4.1039 3.8796 3.9519 3.7426 4.4386 4.2956 2.7401 3.6645 4.9405 6.0995 1.4158 1.3906 4.6357 3.3253 1.4967 2.1651 1.6074 4.1522 1.9994 2.5271 1.5449 1.5030 2.1119 1.5856 1.3369 1.7779 2.6770 2.7629 2.3406 2.6072 1.6449 2.4735 2.5620 1.5879 1.1231 1.4422 1.2298 1.2808 1.9899 2.2194 1.1652 1.4465 1.7981 1.3366 1.5520 2.9191 1.2197 1.6073 1.7170 1.5788 7.8903 2.2833 1.3341 1.3007 1.1230 1.2322 1.2678 1.0436 1.0554 3.9348 7.0540 6.3769 7.4241 6.6405 1.0838 1.0551 1.0511 1.0384 1.0457 1.1022 1.1064 1.0995 1.0934 1.1000 1.1019 1.0866 1.0885 1.0916 1.0950 1.0965 1.0933 1.0655
irintensity: 0.3188 2.2975 4.2868 0.8703 1.8418 0.5197 1.6048 6.4666 3.9246 0.4086 0.2721 1.5144 1.5556 0.6275 6.1930 6.0963 1.5353 2.0507 40.2375 131.4815 4.9818 11.9367 1.9991 4.2313 1.7119 6.3963 10.4862 22.0523 8.1668 1.6812 2.0381 3.8319 21.7136 5.9793 86.3193 0.4605 0.1671 28.2266 36.7142 0.4623 39.0137 13.6654 5.7728 16.5433 4.8458 40.8713 21.5963 2.1921 3.3980 12.7825 9.4470 149.1175 71.9962 9.3015 8.3875 19.4566 7.0673 1.3371 27.2360 5.0082 122.8222 153.4543 270.3425 3.6943 29.7310 48.5179 4.8045 5.3770 39.7315 58.6518 8.2153 4.0037 26.5173 1.5930 23.8490 16.4091 19.8940 47.7727 5.7928 17.6512 12.0736 13.4797 84.2094 182.1890 140.6334 45.8028 9.7881 33.7934 23.6072 51.6681 4.4611 27.9756 2.0020 46.3235 60.4662 13.0187 27.4581 15.2027 5.9617 1.6549 15.2734 13.7221 16.3211 13.4186 5.5921
temp: 298.150 k
press: 1.00000 atm
elementType: 8 8 8 6 6 6 6 6 6 6 6 6 6 6 6 6 6 6 6 1 1 1 1 1 1 1 1 1 1 1 1 1 1 1 1 1 1
symmnumber: 1
zpe: 789297.7 jmol-1
zpe.correction: 0.300628 hartree
zpe.thermalcorrener: 0.319076 hartree
zpe.thermalcorrenthalpy: 0.320020 hartree
zpe.thermalcorrgfe: 0.253185 hartree
zpe.sumelectzpe: -844.774003 hartree
zpe.sumelectthermal: -844.755554 hartree
zpe.sumelectthermalent: -844.754610 hartree
zpe.sumelectthermalfe: -844.821445 hartree
dipole: -1.6530 1.9254 -0.2363
dipole: 2.5486
quadrupole: -115.2233 -110.4616 -117.5838
quadrupole: 20.6505 12.1693 -2.8354
quadrupole: -0.8004 3.9613 -3.1609 20.6505 12.1693 -2.8354
hfenergy: -845.0746301 hartree
pointgroup: C01 [X(C16H18O3)]
dipole: 0.6513452 0.7620182 0.021257 debye
polarizability: 267.5626431|4.1255813|215.2472822|14.9879601|-18.0601479|104.2679301 unknown
InChI: InChI=1S/C16H18O3/c1-3-12(18)10-19-16-9-8-13(11(2)17)14-6-4-5-7-15(14)16/h4-9,12,18H,3,10H2,1-2H3
charge 0 multiplicity 1
37 atoms
O  1.710252 0.142417 0.244371
O  4.228066 0.397339 -1.016447
O  -4.119268 -2.572876 0.529825
C  4.093589 -0.127303 0.351918
C  -0.593707 0.780146 0.013512
C  2.761253 -0.870556 0.495943
C  -2.004408 0.442437 -0.05173
C  0.374678 -0.26902 0.230881
C  5.29762 -1.049879 0.599754
C  -2.404758 -0.946762 0.089964
C  -0.035069 -1.594437 0.424549
C  -1.415056 -1.911186 0.355903
C  -0.172861 2.142847 -0.108623
C  -2.931429 1.530713 -0.188124
C  6.635429 -0.282922 0.56477
C  -1.106788 3.167462 -0.274267
C  -2.498225 2.854706 -0.301805
C  -3.798043 -1.496399 -0.062647
C  -4.8145 -0.847326 -1.004121
H  4.10543 0.712982 1.08161
H  2.685219 -1.67618 -0.260842
H  2.636013 -1.289609 1.513957
H  5.296668 -1.837656 -0.178443
H  5.171087 -1.551044 1.580476
H  0.686816 -2.39355 0.610098
H  -1.741887 -2.94716 0.492301
H  0.895879 2.365595 -0.04953
H  -4.003743 1.329878 -0.17396
H  6.745136 0.244345 -0.397552
H  6.684863 0.468621 1.37518
H  7.490466 -0.971541 0.688044
H  -0.776512 4.207737 -0.363423
H  -3.234614 3.659945 -0.399891
H  3.411713 0.922886 -1.220967
H  -5.404385 -1.656328 -1.466605
H  -4.349266 -0.228207 -1.78767
H  -5.525357 -0.221017 -0.43121
