program: Gaussian 09
title: 000264778
version: EM64L-G09RevD.01
frameworkgroup: C1[X(C13H12N4O)]
method: RPBEPBE
basis: SDD
operation: Freq
keyword: #p
keyword: freq=noraman
keyword: PBEPBE/SDD
title: #p freq=noraman PBEPBE/SDD
converged: YES YES NO NO
title: Mulliken charges:
elementType: O N N N N C C C C C C C C C C C C C H H H H H H H H H H H H
charge: -0.227088 -0.267734 -0.020818 -0.037758 -0.066945 0.459876 0.101536 -0.083510 -0.477747 -0.237028 0.469368 -0.384536 0.162725 -0.439430 -0.212952 -0.809026 -0.361863 -0.502683 0.290971 0.271994 0.242103 0.237162 0.229598 0.238116 0.222869 0.235741 0.247607 0.241549 0.241713 0.236191
chargesum: 0.00000
title: Mulliken charges with hydrogens summed into heavy atoms:
elementType: O N N N N C C C C C C C C C C C C C
charge: -0.227088 -0.267734 -0.020818 -0.037758 -0.066945 0.459876 0.101536 -0.083510 -0.186775 0.034966 0.469368 -0.142433 0.162725 -0.202269 0.016646 -0.112300 -0.114257 0.216770
polarizability: 2.72511447e+02 5.55906144e+00 1.77419883e+02 3.47999886e+00 9.76807868e-01 8.15748954e+01
1716.lowfreq: -21.7834 -4.7808 0.0007 0.0008 0.0009 4.0308 12.8034 30.9200 44.5357
frequency: -19.1059 30.8550 44.5333 83.1518 109.7717 137.8434 172.7374 181.8919 206.4476 216.2948 260.7262 276.4401 286.9643 323.9836 365.7647 420.3494 439.8605 494.0520 517.9125 542.9854 575.8833 603.6640 640.6420 643.0981 662.4388 683.5417 696.0338 706.0304 786.6660 789.2143 824.3576 826.7768 841.1796 887.1703 899.5855 913.4661 921.4227 970.0057 978.3996 988.9544 1006.6079 1050.8128 1071.5791 1102.9550 1111.7365 1116.6648 1155.1617 1158.6902 1185.9566 1204.1223 1246.2434 1277.1977 1285.5730 1314.6214 1316.5397 1323.8354 1370.1734 1385.0398 1397.4574 1399.2643 1434.6104 1436.8148 1451.0656 1455.2396 1462.1274 1469.7471 1476.9812 1491.6223 1520.5103 1567.4067 1601.0257 1619.4015 2981.3574 3006.8835 3061.3162 3089.4408 3110.8271 3129.8334 3145.4637 3149.9593 3163.9863 3168.1633 3169.5275 3242.6361
redmass: 1.0550 3.9309 4.8196 4.5895 3.6447 1.3679 2.6148 4.1957 3.7999 4.5087 5.6873 4.1932 4.9665 5.3822 4.4278 4.1043 2.8459 9.3876 5.1788 3.8344 4.2661 6.8931 5.3386 5.9213 7.6543 6.8400 2.3317 5.4229 5.3486 1.4758 1.6863 6.2197 8.3846 1.3214 7.3472 1.4427 1.4383 2.8481 1.3504 5.7501 1.9350 1.5704 3.6957 1.5670 1.2532 3.2301 1.7816 3.6248 1.1572 1.8373 2.6743 4.1932 3.3243 2.9757 3.9262 1.6599 7.2746 5.1976 1.4752 1.2796 2.3393 1.9081 1.0509 2.9190 1.0554 1.0458 1.3837 2.2534 6.6811 10.1176 5.9695 6.3276 1.0372 1.0290 1.0975 1.0992 1.1046 1.0869 1.0917 1.1053 1.0976 1.0943 1.0923 1.0981
irintensity: 0.4881 0.3709 1.5116 0.6583 4.6860 0.1538 4.1599 6.6254 2.0164 0.8783 0.5563 1.3845 0.8737 0.7689 5.4934 0.8581 8.5967 0.4009 1.4106 0.7688 1.4631 3.5825 21.7994 20.8003 0.4539 6.9773 23.4020 4.4927 9.2865 55.3702 9.3167 25.7712 10.4996 4.7165 3.7005 7.2877 14.6826 39.5154 0.1324 5.1580 18.4893 15.3434 50.0968 14.1534 0.1050 40.3363 0.9863 61.6192 1.6510 25.4682 10.3523 65.1274 241.4000 34.0479 133.3732 33.7837 23.1766 6.9733 58.8612 14.5264 34.6855 17.9144 14.0077 40.1124 39.8759 14.2669 13.0676 180.8377 40.5196 361.3126 19.5635 51.4608 27.1502 53.5406 17.1181 21.0488 25.4975 4.5178 25.1909 19.9808 10.9263 6.8307 11.7124 0.2043
temp: 298.150 k
press: 1.00000 atm
elementType: 8 7 7 7 7 6 6 6 6 6 6 6 6 6 6 6 6 6 1 1 1 1 1 1 1 1 1 1 1 1
symmnumber: 1
zpe: 603140.8 jmol-1
zpe.correction: 0.229724 hartree
zpe.thermalcorrener: 0.244186 hartree
zpe.thermalcorrenthalpy: 0.245130 hartree
zpe.thermalcorrgfe: 0.187374 hartree
zpe.sumelectzpe: -795.540513 hartree
zpe.sumelectthermal: -795.526051 hartree
zpe.sumelectthermalent: -795.525107 hartree
zpe.sumelectthermalfe: -795.582863 hartree
dipole: -2.2142 0.9509 -0.0296
dipole: 2.4099
quadrupole: -83.4481 -102.0798 -107.1771
quadrupole: 7.7483 -1.1063 3.5425
quadrupole: 14.1203 -4.5115 -9.6088 7.7483 -1.1063 3.5425
hfenergy: -795.770237 hartree
pointgroup: C01 [X(C13H12N4O1)]
dipole: -0.8677264 -0.3821106 -0.002577 debye
polarizability: 272.6106403|-4.5812953|177.1440343|-3.4683312|4.2884266|81.7515503 unknown
InChI: InChI=1S/C13H12N4O/c1-9-4-3-5-10(6-9)17-8-16-11-12(17)14-7-15-13(11)18-2/h3-8H,1-2H3
charge 0 multiplicity 1
30 atoms
O  4.348385 0.54291 -0.140686
N  -0.31583 0.775125 -0.068121
N  1.639257 1.980144 -0.320219
N  0.675467 -1.494771 0.260409
N  3.122994 -1.454376 0.207214
C  -1.731663 0.536044 0.028564
C  0.739284 -0.148405 0.045339
C  1.936757 0.622465 -0.104741
C  -2.264349 -0.730749 -0.302199
C  0.299837 2.027282 -0.291994
C  -3.659976 -0.96388 -0.226922
C  -2.58445 1.586085 0.452304
C  3.152224 -0.111126 -0.010717
C  -4.510507 0.095651 0.176002
C  -3.973383 1.35905 0.512968
C  -4.220803 -2.33016 -0.581169
C  1.905338 -2.072855 0.330772
C  5.578081 -0.27866 -0.032887
H  -1.585987 -1.537979 -0.592105
H  -0.284354 2.928248 -0.460636
H  -2.173585 2.554162 0.756081
H  -5.592126 -0.071086 0.234664
H  -4.637566 2.166187 0.840087
H  -3.748548 -3.124533 0.025486
H  -5.310239 -2.375637 -0.413651
H  -4.031364 -2.577285 -1.642614
H  1.929582 -3.15235 0.503851
H  5.592216 -1.054357 -0.81622
H  5.631231 -0.763658 0.955797
H  6.393777 0.445011 -0.169458
