program: Gaussian 09
title: 000264775
version: EM64L-G09RevD.01
frameworkgroup: C1[X(C9H9ClN4O)]
method: RPBEPBE
basis: SDD
operation: Freq
keyword: #p
keyword: freq=noraman
keyword: PBEPBE/SDD
title: #p freq=noraman PBEPBE/SDD
converged: YES YES NO NO
title: Mulliken charges:
elementType: Cl O N N N N C C C C C C C C C H H H H H H H H H
charge: -0.052486 -0.245917 -0.379170 -0.071931 -0.653656 0.050078 -0.516283 0.363706 0.214206 0.281789 -0.388185 -0.256756 -0.169369 -0.278414 -0.375176 0.269766 0.242937 0.306621 0.274144 0.253837 0.258105 0.305938 0.319217 0.246999
chargesum: 0.00000
title: Mulliken charges with hydrogens summed into heavy atoms:
elementType: Cl O N N N N C C C C C C C C C
charge: -0.052486 -0.245917 -0.072549 -0.071931 -0.028500 0.050078 -0.003580 0.363706 0.214206 0.281789 -0.114041 -0.002919 0.088736 -0.278414 -0.128177
polarizability: 1.78831108e+02 4.22088047e+00 1.42453598e+02 -6.45263091e+00 -1.07731112e+00 8.97241911e+01
1716.lowfreq: -6.7575 -0.0028 -0.0021 -0.0018 1.8620 5.6171 20.8466 26.0457 35.6087
frequency: 19.8657 26.0310 35.5942 87.0812 158.9699 170.8515 211.7770 232.0329 246.1318 303.1119 328.1718 341.8726 364.9246 425.8289 501.4344 536.3068 557.4656 583.6560 586.0592 594.5169 606.6067 629.2785 676.8536 723.4612 732.4284 759.5733 782.8228 826.0947 841.3000 870.3991 877.4441 883.6884 894.7633 951.1867 1013.4034 1041.0132 1049.4826 1075.3382 1132.6917 1143.6291 1181.2377 1203.2537 1218.9123 1275.8340 1302.4792 1326.0124 1352.2005 1365.0932 1394.1784 1427.7674 1440.2093 1461.5516 1484.9934 1539.4911 1562.2501 1592.5264 1632.0275 3026.9988 3113.1596 3179.8069 3221.7456 3238.6259 3267.5005 3501.9019 3517.7247 3637.0558
redmass: 4.8637 6.6880 5.8982 6.6123 5.0354 5.5814 9.5426 6.0152 4.2700 3.3916 2.7755 1.2450 5.5571 4.7785 4.9811 3.0334 2.3851 1.6614 2.4893 3.0343 3.5201 3.7997 3.7924 1.7352 2.3481 9.4425 6.6147 1.5002 3.0021 6.4708 3.4947 1.4659 1.4129 2.1470 1.5273 3.1266 5.3121 1.9789 1.5363 2.6593 3.7339 3.0164 1.7085 1.4711 4.0247 2.8493 1.3505 2.3614 1.7837 1.2831 1.8430 3.4167 5.0845 3.8016 4.8789 6.7966 1.2603 1.0648 1.0983 1.0925 1.0915 1.0996 1.1085 1.0454 1.0759 1.1018
irintensity: 2.7437 0.6368 1.2934 1.6852 0.8997 0.9333 0.3846 0.6763 2.1316 1.9488 6.6908 56.9434 9.9619 20.3845 3.8112 37.4552 72.0891 194.3426 35.1096 9.0884 63.8605 26.9336 12.8392 30.0893 88.6699 14.3762 22.2974 20.8070 25.6412 3.5129 10.4698 3.3510 15.3818 2.2298 32.2040 4.5618 79.4844 130.0202 20.3702 4.9581 16.4829 22.8003 16.5615 21.8036 9.4396 58.0591 16.8795 1.1569 60.4005 34.1245 57.7311 55.8670 7.4567 547.6523 39.4216 0.8617 143.6799 33.8010 1.1952 11.7869 3.9850 0.0550 0.5648 33.8723 28.1227 32.6822
temp: 298.150 k
press: 1.00000 atm
elementType: 17 8 7 7 7 7 6 6 6 6 6 6 6 6 6 1 1 1 1 1 1 1 1 1
symmnumber: 1
zpe: 462283.0 jmol-1
zpe.correction: 0.176074 hartree
zpe.thermalcorrener: 0.189540 hartree
zpe.thermalcorrenthalpy: 0.190484 hartree
zpe.thermalcorrgfe: 0.133176 hartree
zpe.sumelectzpe: -1101.541423 hartree
zpe.sumelectthermal: -1101.527957 hartree
zpe.sumelectthermalent: -1101.527013 hartree
zpe.sumelectthermalfe: -1101.584321 hartree
dipole: -3.0166 -3.3504 0.8954
dipole: 4.5964
quadrupole: -101.3728 -84.6636 -92.6329
quadrupole: -8.9672 7.2228 -2.3308
quadrupole: -8.4831 8.2262 0.2569 -8.9672 7.2228 -2.3308
hfenergy: -1101.717497 hartree
pointgroup: C01 [X(C9H9Cl1N4O1)]
dipole: -1.1368751 0.8612312 -1.1117165 debye
dipolederiv: -0.6492582 -0.3645437 -0.1996582 -0.4572036 -0.4465096 -0.1468025 -0.2183591 -0.1339576 -0.1808189 -0.3096452 0.0223104 0.1263496 0.0404113 -0.3714244 0.2031012 0.0965456 0.2400757 -0.4643549 -1.2981256 -0.0041054 -0.1460106 0.0613471 -0.1913935 0.1411341 -0.7053361 0.0495309 -0.945519 -0.5917622 -0.1049299 -0.1634329 0.3220093 -0.356022 0.16155 -0.3009111 -0.0301345 -0.3317799 -0.4303254 0.25675 0.1473625 0.0321985 -1.1951085 0.3198163 0.1661905 0.2384605 -0.3635412 -0.4826968 -0.130498 -0.1600416 -0.1515205 -0.7907813 0.1283983 -0.2571395 0.141243 -0.3267944 0.8419532 0.1532446 -0.0106439 0.4490755 0.1903173 0.1730133 0.0048661 0.047 0.3926221 0.095091 -0.125056 -0.0825244 -0.2013257 0.1569652 -0.254845 0.0192521 -0.1854625 0.0215801 1.3110949 -0.2130174 0.6850478 -0.2626177 0.0593195 -0.0361997 0.9022389 -0.1804804 0.6314025 -0.6884172 -0.1363305 -0.467181 -0.2552319 0.8199245 -0.5500373 -0.5446998 -0.4858365 -0.0040083 -0.0945417 -0.105966 0.0004701 -0.0906905 -0.1053057 -0.0087953 -0.0047745 -0.0050401 -0.1386055 -0.0903131 -0.0407549 -0.1208958 -0.0293947 -0.1336737 -0.0008769 -0.0821555 -0.0406251 -0.0714041 -0.0750059 -0.0392976 -0.1302069 0.0324986 0.0502461 -0.2081277 -0.0872933 -0.1808568 0.2037483 1.034606 0.6626238 0.4188327 0.4813091 0.8075914 0.0298519 0.6471943 0.2699181 0.2711562 0.3807472 0.2165736 0.2215951 -0.0136151 0.4554203 -0.1459751 0.3674238 -0.0416138 0.1512757 0.0733413 0.0447611 0.0505381 -0.0308722 0.0054953 -0.0316736 0.0619704 0.0495029 0.1373667 -0.0657929 -0.0228553 -0.0632686 -0.0336235 0.0993298 0.0793018 -0.0414478 0.0098838 -0.1019404 0.1442639 -0.0109009 -0.1075185 -0.040147 0.1087243 -0.0345389 0.0085287 -0.0620593 0.3424684 0.1270813 0.1017025 -0.009521 0.0987797 0.0808891 0.0476122 -0.0212194 0.0476572 0.1262219 0.0733703 0.0086528 0.0979897 0.0090002 0.1472748 0.0502516 0.1215062 0.0457197 0.0495871 0.0774545 0.0855641 0.0431753 0.1000251 0.0957185 0.043696 0.0372597 0.0559107 0.135428 0.2943309 -0.1446563 -0.0452857 -0.036006 0.2749989 -0.0471846 -0.0778817 0.0557043 0.1337009 0.2277187 -0.0845732 -0.0650682 -0.0163427 0.289946 0.0300001 -0.0518315 0.0335751 0.2421954 0.0948313 -0.0246979 -0.0201037 -0.0080633 -0.051942 0.0573297 -0.0399271 0.0618846 0.0900132 unknown
polarizability: 172.4733394|8.6992577|131.7918221|22.848673|-19.2276992|106.7437355 unknown
InChI: InChI=1S/C9H9ClN4O/c10-8-7(11)9(14-5-13-8)12-4-6-2-1-3-15-6/h1-3,5,12H,4,11H2
charge 0 multiplicity 1
24 atoms
Cl 4.133227 1.478106 1.626587
O  -3.401559 0.686164 -0.738825
N  -0.199848 0.357334 -1.075104
N  0.768161 -1.339008 0.283859
N  1.911658 2.134444 -0.428221
N  2.759046 -0.890839 1.584646
C  -1.346259 -0.519449 -1.416208
C  -2.511379 -0.389127 -0.479912
C  0.799178 -0.065426 -0.207048
C  1.867267 0.853453 0.12633
C  -2.932453 -1.064449 0.653503
C  -4.131328 -0.404342 1.131572
C  -4.383422 0.647719 0.268748
C  2.786812 0.347489 1.067182
C  1.759247 -1.702444 1.144738
H  -0.978293 -1.555851 -1.387891
H  -1.665961 -0.2801 -2.446332
H  -0.371679 1.365886 -1.116594
H  -2.430873 -1.922757 1.095235
H  -4.724986 -0.678631 2.001317
H  -5.153456 1.411441 0.206503
H  1.60475 2.262212 -1.392769
H  2.649233 2.757334 -0.096452
H  1.743216 -2.726156 1.525636
