program: Gaussian 09
title: 000264777
version: EM64L-G09RevD.01
frameworkgroup: C1[X(C14H14N4O)]
method: RPBEPBE
basis: SDD
operation: Freq
keyword: #p
keyword: freq=noraman
keyword: PBEPBE/SDD
title: #p freq=noraman PBEPBE/SDD
converged: YES YES NO NO
title: Mulliken charges:
elementType: O N N N N C C C C C C C C C C C C C C H H H H H H H H H H H H H H
charge: -0.226768 -0.267400 -0.021478 -0.040072 -0.068074 0.458861 0.100907 -0.101627 -0.238360 -0.478168 0.469332 -0.383857 0.172908 -0.439874 -0.213716 -0.809119 -0.363940 -0.222684 -0.675279 0.271378 0.292481 0.241282 0.236977 0.229295 0.238059 0.222644 0.235612 0.247230 0.229656 0.228590 0.208338 0.233547 0.233318
chargesum: 0.00000
title: Mulliken charges with hydrogens summed into heavy atoms:
elementType: O N N N N C C C C C C C C C C C C C C
charge: -0.226768 -0.267400 -0.021478 -0.040072 -0.068074 0.458861 0.100907 -0.101627 0.033017 -0.185687 0.469332 -0.142575 0.172908 -0.202897 0.015579 -0.112804 -0.116710 0.235563 -0.000076
polarizability: 2.95119758e+02 5.75795907e+00 1.87231719e+02 2.74986708e+00 1.31565040e+00 9.02439521e+01
1716.lowfreq: -17.1402 -7.2807 -0.0003 0.0003 0.0006 4.0493 7.1099 23.8874 32.9436
frequency: -13.6905 21.0926 32.9352 56.9278 73.8065 101.5190 126.7721 157.2917 205.7196 214.8718 239.9518 253.2900 259.4952 281.3685 321.3348 334.4117 352.4938 416.8605 439.7454 512.7016 520.8194 543.1312 575.6464 603.1441 640.7931 650.1271 662.5635 683.5477 697.1874 725.4440 786.3374 789.0325 798.5837 812.3229 823.1265 832.1814 857.7510 887.7537 914.2522 922.0914 960.5319 978.2046 987.9584 1001.8916 1016.8159 1050.7662 1069.5094 1100.7450 1103.5929 1132.6177 1135.4281 1158.7061 1185.9668 1204.4760 1245.9278 1246.3798 1276.7248 1284.6040 1310.6711 1314.2569 1321.7293 1352.9614 1370.5616 1385.6323 1398.2213 1399.1787 1409.4476 1435.8508 1453.0109 1461.3828 1469.6234 1470.0226 1476.8648 1485.1906 1492.2496 1519.5336 1565.5489 1601.3351 1619.5384 2981.3627 2996.9122 3013.7863 3061.3671 3073.7219 3089.2978 3093.8302 3111.0891 3129.6026 3145.5653 3164.0756 3167.7492 3168.1134 3242.8628
redmass: 1.0841 2.9469 4.0693 2.9842 4.2041 2.8429 4.2233 4.6831 4.0017 3.9602 1.3999 4.0182 4.6442 4.3162 5.1892 3.5450 5.1223 3.9928 2.8390 6.1816 6.0037 3.8743 4.2741 6.8378 5.2277 7.2078 7.5810 6.8682 2.1131 6.8313 5.1589 1.4771 1.0989 4.9024 1.6965 5.5805 7.5229 1.3195 1.4351 1.4395 3.2006 1.3499 4.8296 1.8174 2.2556 1.5710 3.8232 2.5525 1.6289 1.4648 4.0498 3.5820 1.1560 1.8362 1.1942 2.4547 4.2933 3.1268 2.7457 7.0886 1.3674 1.4798 7.3222 5.0808 1.2699 1.2836 1.8472 3.1366 3.4685 1.0401 1.0485 1.0880 1.3751 1.1016 2.1766 6.6107 9.9991 5.9683 6.3237 1.0372 1.0359 1.0580 1.0975 1.1066 1.0992 1.0984 1.1028 1.0870 1.0916 1.0972 1.0944 1.0926 1.0980
irintensity: 0.5749 0.4181 0.7428 0.5745 1.1091 3.4888 2.4887 1.6650 1.4236 1.4112 0.5982 0.1366 0.6651 0.1522 1.8014 5.1420 4.0531 0.4116 8.3470 1.0248 1.8390 0.7100 1.5804 3.9580 17.7845 24.8263 0.4076 8.1218 26.4014 0.5790 10.2158 55.5044 3.4479 5.8308 9.3352 36.6367 5.5823 4.5534 8.2198 14.2062 39.9205 0.1356 2.1356 3.5769 80.9785 15.9883 95.5054 0.6361 21.6940 5.5586 26.4338 60.7077 2.2868 28.4569 1.6893 14.1120 104.5946 320.4572 41.7503 170.8313 12.3427 0.4187 23.1812 7.8297 58.3755 18.7660 61.4832 5.6376 50.4318 11.9556 15.0874 28.4708 15.8840 22.3121 165.7060 32.2737 375.1843 20.1512 54.2016 27.4649 24.4455 22.0106 17.1611 6.8764 21.3009 29.7034 41.9162 4.7573 25.7277 9.7762 11.8825 9.5187 0.1709
temp: 298.150 k
press: 1.00000 atm
elementType: 8 7 7 7 7 6 6 6 6 6 6 6 6 6 6 6 6 6 6 1 1 1 1 1 1 1 1 1 1 1 1 1 1
symmnumber: 1
zpe: 676018.2 jmol-1
zpe.correction: 0.257482 hartree
zpe.thermalcorrener: 0.273380 hartree
zpe.thermalcorrenthalpy: 0.274324 hartree
zpe.thermalcorrgfe: 0.212470 hartree
zpe.sumelectzpe: -834.770219 hartree
zpe.sumelectthermal: -834.754321 hartree
zpe.sumelectthermalent: -834.753377 hartree
zpe.sumelectthermalfe: -834.815230 hartree
dipole: -1.8851 0.7166 0.0125
dipole: 2.0168
quadrupole: -86.2730 -108.0489 -113.3974
quadrupole: 7.0594 -1.1367 3.3847
quadrupole: 16.3001 -5.4758 -10.8243 7.0594 -1.1367 3.3847
hfenergy: -835.0277004 hartree
pointgroup: C01 [X(C14H14N4O1)]
dipole: -0.7380642 -0.2909817 -0.0130756 debye
polarizability: 295.2429698|-4.3080251|186.9396685|-3.061492|4.1872085|90.412791 unknown
InChI: InChI=1S/C14H14N4O/c1-3-19-14-12-13(15-8-16-14)18(9-17-12)11-6-4-5-10(2)7-11/h4-9H,3H2,1-2H3
charge 0 multiplicity 1
33 atoms
O  4.003342 0.391097 -0.114795
N  -0.652897 0.745788 -0.070388
N  1.335702 1.897887 -0.307157
N  0.275154 -1.552102 0.2513
N  2.724087 -1.577931 0.211617
C  -2.075054 0.545229 0.019496
C  0.376496 -0.206778 0.04384
C  1.595064 0.531333 -0.096112
C  -0.001955 1.981623 -0.285724
C  -2.639564 -0.709966 -0.303019
C  -4.041322 -0.905225 -0.234038
C  -2.902437 1.621117 0.428849
C  2.791679 -0.232979 0.001601
C  -4.865882 0.180001 0.153958
C  -4.29719 1.431608 0.482975
C  -4.636033 -2.259578 -0.578769
C  1.489414 -2.162768 0.324566
C  5.23029 -0.461392 -0.003637
C  6.415286 0.487948 -0.140282
H  -0.56006 2.899041 -0.453674
H  -1.980856 -1.537433 -0.580951
H  -2.468388 2.58087 0.726605
H  -5.951886 0.042628 0.207484
H  -4.941524 2.25909 0.798817
H  -4.191418 -3.05965 0.041158
H  -5.727826 -2.273317 -0.42132
H  -4.443364 -2.523757 -1.635488
H  1.483259 -3.243645 0.491042
H  5.20667 -0.981644 0.970394
H  5.196809 -1.224402 -0.801677
H  7.359162 -0.082885 -0.067973
H  6.394106 1.007028 -1.113383
H  6.404132 1.248065 0.65899
