program: Gaussian 09
title: 000264768
version: EM64L-G09RevD.01
frameworkgroup: C1[X(C11H11ClN4)]
method: RPBEPBE
basis: SDD
operation: Freq
keyword: #p
keyword: freq=noraman
keyword: PBEPBE/SDD
title: #p freq=noraman PBEPBE/SDD
converged: YES YES NO NO
title: Mulliken charges:
elementType: Cl N N N N C C C C C C C C C C C H H H H H H H H H H H
charge: -0.033506 -0.439236 -0.076729 -0.663267 0.041797 0.464837 0.485653 -0.479723 0.192953 -0.480502 -0.457325 -0.186591 0.129498 -0.813839 -0.257294 -0.354169 0.314811 0.355939 0.227430 0.233506 0.224022 0.233301 0.220571 0.233176 0.316168 0.316181 0.252339
chargesum: 0.00000
title: Mulliken charges with hydrogens summed into heavy atoms:
elementType: Cl N N N N C C C C C C C C C C C
charge: -0.033506 -0.083297 -0.076729 -0.030918 0.041797 0.464837 0.485653 -0.164912 0.192953 -0.253072 -0.223819 0.037430 0.129498 -0.126791 -0.257294 -0.101831
polarizability: 2.79545102e+02 6.21325899e+00 1.68609519e+02 2.99449806e-02 1.70671226e-02 6.82290920e+01
1716.lowfreq: -183.2277 -12.0796 -2.0504 -0.0032 -0.0023 -0.0018 6.0147 14.1944 34.7418
frequency: -183.2217 12.2503 34.7385 50.7567 86.7878 119.3821 179.6291 198.0974 208.9873 244.0620 247.6483 267.2267 310.7235 364.7608 373.5406 442.8567 488.1794 503.7107 517.2967 563.7340 570.4172 599.1131 610.4408 689.0890 700.3525 731.0592 753.6061 765.9633 784.8661 788.5265 853.4912 889.1547 892.7428 934.1650 941.2603 958.2119 972.4430 985.9909 1011.6290 1051.0194 1100.4232 1109.1869 1155.0130 1160.1796 1172.8799 1181.8246 1256.3210 1284.9949 1303.8026 1324.9842 1374.6733 1383.3887 1394.4197 1402.3324 1443.9116 1464.4177 1468.7868 1477.1444 1488.6234 1546.1090 1566.8863 1602.1481 1619.2048 1636.4259 2979.5604 3059.0934 3086.7662 3115.2378 3130.7678 3156.0951 3167.5423 3173.2033 3369.0466 3440.8017 3548.3197
redmass: 1.0414 1.0293 6.2311 4.8471 5.6023 6.0530 6.8953 9.2959 3.0296 4.2319 4.9976 5.8000 4.5440 5.2034 4.6590 2.8845 5.7374 3.4982 5.0400 7.0258 3.7340 7.0635 7.9646 2.5534 1.9208 4.1976 5.3600 2.5007 1.6389 10.6952 1.1980 1.3155 4.8831 1.4386 1.3480 2.6896 1.3437 5.8415 1.7122 1.5724 1.7847 3.7326 4.3966 1.2888 2.0510 1.0807 3.2663 6.5337 1.3825 3.3595 3.5891 2.1372 1.3615 2.4734 2.6409 3.0603 1.0459 1.6157 1.8574 9.0089 3.1236 5.0984 5.3093 1.1399 1.0370 1.0976 1.0991 1.0879 1.0904 1.0989 1.0925 1.0930 1.0748 1.0453 1.0966
irintensity: 33.0853 0.5745 0.3060 0.0179 0.7295 0.7538 3.2362 0.0014 3.1052 0.1866 3.8710 0.8759 3.3256 2.7772 9.8055 6.7860 9.1301 3.1661 1.1037 2.0374 0.1148 34.5596 0.9471 50.3141 26.0066 43.5327 4.0652 103.1333 20.6078 21.4252 108.2119 17.7920 20.8700 13.2839 13.0952 57.1105 0.3764 11.5734 19.3466 17.2745 7.7564 17.1953 75.3716 0.4981 6.3417 2.6446 20.2904 66.4927 2.6347 52.8751 63.1900 64.7573 23.9907 14.4643 60.7608 78.6084 13.3249 55.5757 19.6186 187.5666 868.0508 161.4535 41.8274 115.5140 32.3266 19.7296 22.8988 7.2557 18.8216 30.0228 15.3173 10.4939 91.3320 11.1193 18.2933
temp: 298.150 k
press: 1.00000 atm
elementType: 17 7 7 7 7 6 6 6 6 6 6 6 6 6 6 6 1 1 1 1 1 1 1 1 1 1 1
symmnumber: 1
zpe: 537377.0 jmol-1
zpe.correction: 0.204676 hartree
zpe.thermalcorrener: 0.218815 hartree
zpe.thermalcorrenthalpy: 0.219759 hartree
zpe.thermalcorrgfe: 0.160999 hartree
zpe.sumelectzpe: -1103.705788 hartree
zpe.sumelectthermal: -1103.691649 hartree
zpe.sumelectthermalent: -1103.690705 hartree
zpe.sumelectthermalfe: -1103.749466 hartree
dipole: -1.7399 -3.1485 0.0164
dipole: 3.5973
quadrupole: -105.4341 -89.3728 -102.6184
quadrupole: -11.3592 0.0375 -0.0052
quadrupole: -6.2923 9.7689 -3.4766 -11.3592 0.0375 -0.0052
hfenergy: -1103.9104644 hartree
pointgroup: C01 [X(C11H11Cl1N4)]
dipole: -0.7914195 1.1626929 -0.1575911 debye
polarizability: 279.6694876|4.1922369|167.1020729|4.1536249|-11.2566144|69.6121523 unknown
InChI: InChI=1S/C11H11ClN4/c1-7-3-2-4-8(5-7)16-11-9(13)10(12)14-6-15-11/h2-6,16H,13H2,1H3
charge 0 multiplicity 1
27 atoms
Cl 5.119521 0.780075 0.153739
N  -0.058458 0.915055 0.023228
N  0.993677 -1.238393 0.29788
N  2.318676 2.248712 -0.080902
N  3.426741 -1.345997 0.36492
C  -1.442674 0.599906 0.029919
C  -3.34711 -0.950924 0.164288
C  -1.949094 -0.717284 0.167266
C  1.059776 0.128566 0.13987
C  -2.343277 1.692982 -0.111691
C  -4.235621 0.143718 0.02296
C  -3.730151 1.457962 -0.114094
C  2.335296 0.819241 0.086929
C  -3.873014 -2.369101 0.312816
C  3.463497 -0.005739 0.208374
C  2.177153 -1.894054 0.401123
H  -1.243103 -1.543693 0.275089
H  0.211138 1.906734 -0.086457
H  -1.95509 2.713743 -0.21795
H  -5.317647 -0.030278 0.0201
H  -4.421091 2.301246 -0.22293
H  -3.542702 -2.819502 1.267418
H  -4.975808 -2.396946 0.288553
H  -3.498985 -3.021101 -0.498492
H  2.705515 2.767671 0.716258
H  2.732377 2.570518 -0.963928
H  2.127663 -2.979617 0.52591
