program: Gaussian 09
title: 000264770
version: EM64L-G09RevD.01
frameworkgroup: C1[X(C12H11N5O)]
method: RPBEPBE
basis: SDD
operation: Freq
keyword: #p
keyword: freq=noraman
keyword: PBEPBE/SDD
title: #p freq=noraman PBEPBE/SDD
converged: NO YES NO NO
title: Mulliken charges:
elementType: O N N N N N C C C C C C C C C C C C H H H H H H H H H H H
charge: -0.203144 -0.276724 -0.352933 -0.027847 -0.007238 -0.692586 0.427375 0.274045 -0.106987 -0.556747 0.355331 -0.245324 -0.418913 0.333330 -0.402867 0.031861 -0.839414 -0.241211 0.258885 0.275032 0.264624 0.333135 0.227687 0.231125 0.231274 0.246845 0.236915 0.330947 0.313523
chargesum: 0.00000
title: Mulliken charges with hydrogens summed into heavy atoms:
elementType: O N N N N N C C C C C C C C C C C C
charge: -0.203144 -0.276724 -0.019799 -0.027847 -0.007238 -0.048116 0.427375 0.274045 -0.106987 -0.297862 0.355331 0.029708 -0.154289 0.333330 -0.175180 0.031861 -0.130170 -0.004296
polarizability: 2.69834087e+02 -1.00875228e+01 1.55303411e+02 -3.10837416e+00 -2.66593763e+00 9.60671154e+01
1716.lowfreq: -11.0512 -6.7071 -2.1725 -0.0007 0.0003 0.0005 26.2976 42.3465 55.5760
frequency: 26.2487 42.3284 55.5724 105.9911 144.5749 177.0054 180.0613 205.3099 242.8756 262.5979 298.4370 307.9820 355.3905 376.0366 389.7955 417.6088 442.0445 462.2989 485.0814 496.1031 518.9675 549.8889 569.4697 580.4512 599.9287 638.5419 650.0998 660.2739 687.1219 730.0903 758.2463 766.1361 790.9784 818.1440 855.6462 871.0379 886.6527 895.9205 929.3761 941.3361 973.1921 996.0032 1026.0372 1042.8912 1061.1862 1100.3293 1148.3846 1153.4535 1186.4462 1235.1122 1263.9029 1287.1268 1314.7061 1321.7526 1355.8844 1373.5200 1382.1653 1402.3602 1417.1707 1433.6545 1472.7737 1483.1660 1508.5902 1517.4583 1532.2648 1582.6916 1596.1192 1628.4642 1636.5988 1648.0452 2957.1436 3025.3577 3091.7115 3120.2061 3125.9034 3139.8233 3149.8490 3240.6384 3524.5251 3566.2646 3704.0625
redmass: 4.3589 7.0302 5.6656 7.4912 3.7234 3.2239 1.3598 3.0795 5.0427 6.2901 4.2525 3.6578 4.8388 1.1691 3.3839 1.3391 2.6943 3.5377 9.1289 3.8981 5.0186 3.8825 1.2435 5.2902 5.2114 3.7626 7.2500 10.6550 6.6258 3.6719 3.7430 2.7473 2.5970 1.5003 6.4530 6.9337 1.4579 1.3724 7.3028 1.3508 2.4818 2.0406 1.6236 1.5164 2.4772 2.7860 1.5383 3.1920 1.9097 1.9587 3.0928 1.6556 2.4020 2.4701 1.3940 5.4341 4.0828 1.4411 4.1019 2.9071 1.0470 1.3128 4.1584 3.6011 6.9595 7.0775 7.2394 2.9188 12.3163 1.4878 1.0398 1.0975 1.0954 1.0924 1.0877 1.0924 1.0971 1.0987 1.0792 1.0453 1.1036
irintensity: 0.3499 3.6702 1.4889 0.4742 4.5879 1.1665 0.6920 2.7505 4.8297 4.4457 0.6137 1.0698 0.7121 125.6956 40.0818 126.0594 0.2246 2.4613 1.8776 11.8394 2.1594 11.1603 87.6996 4.5507 1.2851 4.2333 9.6471 3.1928 23.6413 3.9890 8.0051 18.3491 3.8838 41.4000 0.6840 16.1832 11.7887 10.4318 51.0505 1.8305 12.4033 3.0325 7.0267 5.5941 32.2092 48.9816 8.8076 28.7074 18.6727 14.7221 0.8173 3.8070 84.4062 35.0591 9.9739 32.9052 5.5597 12.5611 10.7664 13.1070 13.7780 9.6668 74.6605 90.0927 527.8217 15.5000 42.9798 9.4914 456.7664 207.9169 36.7823 21.4753 11.1305 20.1119 18.4675 6.5058 5.7586 0.3554 46.6288 96.0545 26.9230
temp: 298.150 k
press: 1.00000 atm
elementType: 8 7 7 7 7 7 6 6 6 6 6 6 6 6 6 6 6 6 1 1 1 1 1 1 1 1 1 1 1
symmnumber: 1
zpe: 573600.9 jmol-1
zpe.correction: 0.218473 hartree
zpe.thermalcorrener: 0.233667 hartree
zpe.thermalcorrenthalpy: 0.234611 hartree
zpe.thermalcorrgfe: 0.175411 hartree
zpe.sumelectzpe: -811.597200 hartree
zpe.sumelectthermal: -811.582006 hartree
zpe.sumelectthermalent: -811.581062 hartree
zpe.sumelectthermalfe: -811.640261 hartree
dipole: -15.5031 4.3600 0.8208
dipole: 16.1254
quadrupole: -130.0014 -96.5263 -103.5008
quadrupole: 7.0675 -0.5033 -4.6225
quadrupole: -19.9919 13.4832 6.5087 7.0675 -0.5033 -4.6225
hfenergy: -811.8156729 hartree
pointgroup: C01 [X(C12H11N5O1)]
dipole: -6.093905 1.7177698 0.4035002 debye
polarizability: 269.7787577|-10.4478175|155.4662551|-2.3784454|1.9133815|95.9596007 unknown
InChI: InChI=1S/C12H11N5O/c1-7-4-8(2-3-9(7)13)17-6-16-10-11(17)14-5-15-12(10)18/h2-6,14H,13H2,1H3
charge 0 multiplicity 1
29 atoms
O  4.995803 -0.714574 -0.037858
N  0.315338 -0.560618 -0.403396
N  1.476478 1.423652 0.591541
N  2.177439 -1.847322 -0.792235
N  3.881065 1.218596 0.73701
N  -5.12945 1.014371 -0.171433
C  -1.064814 -0.154044 -0.342248
C  1.422723 0.169669 0.010258
C  2.568584 -0.61786 -0.223679
C  -2.010774 -0.959234 0.336379
C  -3.371833 -0.600084 0.399228
C  0.844315 -1.788747 -0.883146
C  -1.483837 1.043504 -0.969578
C  -3.793293 0.622824 -0.225085
C  -2.833789 1.431025 -0.900781
C  3.905716 -0.114423 0.131661
C  -4.38064 -1.472899 1.119406
C  2.763415 1.87851 0.932591
H  -1.672591 -1.877467 0.830163
H  0.195374 -2.55598 -1.298192
H  -0.767697 1.646644 -1.539119
H  0.636966 1.975269 0.783435
H  -3.157309 2.356351 -1.391876
H  -4.869252 -0.933443 1.955739
H  -5.181431 -1.822988 0.436865
H  -3.901403 -2.369575 1.544697
H  2.788996 2.873113 1.395639
H  -5.82912 0.439578 0.287906
H  -5.437379 1.870051 -0.624892
