program: Gaussian 09
title: 000264769
version: EM64L-G09RevD.01
frameworkgroup: C1[X(C12H10ClN5)]
method: RPBEPBE
basis: SDD
operation: Freq
keyword: #p
keyword: freq=noraman
keyword: PBEPBE/SDD
title: #p freq=noraman PBEPBE/SDD
converged: YES YES NO NO
title: Mulliken charges:
elementType: Cl N N N N N C C C C C C C C C C C C H H H H H H H H H H
charge: 0.016801 -0.263877 -0.022509 -0.009316 -0.694703 0.060895 0.478327 0.097501 -0.575752 0.351228 0.127652 -0.357155 0.337243 -0.227133 -0.418905 -0.841015 -0.309343 -0.362406 0.242862 0.277549 0.275950 0.223118 0.230387 0.228843 0.241067 0.326697 0.311389 0.254606
chargesum: 0.00000
title: Mulliken charges with hydrogens summed into heavy atoms:
elementType: Cl N N N N N C C C C C C C C C C C C
charge: 0.016801 -0.263877 -0.022509 -0.009316 -0.056617 0.060895 0.478327 0.097501 -0.332890 0.351228 0.127652 -0.079607 0.337243 0.048817 -0.195787 -0.140719 -0.309343 -0.107800
polarizability: 3.05204911e+02 -3.42857804e+00 1.74393453e+02 1.32708823e-01 3.59120591e-01 8.02515116e+01
1716.lowfreq: -6.3131 -4.8124 -0.0017 -0.0008 0.0015 2.5634 27.4056 39.8453 69.5728
frequency: 27.3500 39.8417 69.5714 117.3159 159.9415 178.6307 185.2407 205.4116 216.7981 247.7712 282.0689 307.1154 335.0505 348.2917 379.9856 382.9350 410.3454 438.2497 459.3869 524.2282 538.2558 551.2752 572.5740 588.6093 624.0928 644.8433 652.4972 666.5776 728.5686 762.2322 786.4739 797.5084 813.7323 838.9498 865.6298 882.0543 897.5704 912.3858 939.1736 981.8746 1012.1999 1040.0091 1042.9161 1108.6181 1138.3890 1156.7627 1169.4081 1194.0928 1237.4534 1270.4018 1289.2700 1308.3851 1311.6409 1326.7856 1368.2597 1387.5786 1398.6755 1404.7005 1433.1991 1451.5612 1473.6221 1484.9586 1496.7146 1519.6226 1558.3232 1590.1359 1630.3469 1646.5330 2955.5799 3023.5361 3086.5514 3130.3963 3133.4334 3183.9534 3184.9246 3241.0909 3568.2192 3706.7772
redmass: 4.4208 8.3385 6.0618 6.5137 4.5499 1.2523 6.6954 3.1924 5.5985 4.5530 5.5545 2.9985 5.8075 1.1392 6.1494 5.4212 1.3096 2.7570 3.4899 4.7425 4.6944 6.2111 4.1504 6.1977 6.9952 4.7326 6.9496 7.8605 3.4765 4.4761 6.7165 10.8383 1.5081 1.5410 6.6525 1.4154 7.1065 1.4320 1.3709 1.8102 1.9091 1.9222 1.5217 4.7129 4.0421 1.5724 4.7651 1.8173 2.6874 2.3853 2.6475 3.0951 2.0619 3.8731 6.3868 2.7425 1.7859 1.6941 3.0305 3.9731 1.0471 1.4500 6.1346 3.1567 10.6455 7.5060 2.2692 1.7351 1.0394 1.0976 1.0956 1.0903 1.0914 1.0928 1.0949 1.0983 1.0451 1.1036
irintensity: 0.0580 0.2998 0.6149 0.4006 0.4134 1.4247 1.3942 0.4287 0.4891 1.4485 2.1283 0.6039 0.4924 185.5110 18.7227 13.0934 92.2941 0.1630 1.5698 6.5474 4.0508 10.8140 10.7034 7.8049 8.1592 8.3921 5.2292 10.4464 1.4013 4.7450 4.6117 40.5887 51.5241 13.6511 14.2004 15.6621 95.9996 13.2074 1.0010 1.0682 8.4097 44.4828 7.1330 13.1883 13.9056 7.5832 98.2880 35.2250 71.9620 9.3445 18.3638 100.8232 26.2330 155.6512 2.9482 1.7809 56.1813 19.6741 2.5079 102.2187 14.4045 36.1362 106.9671 288.5363 89.1667 7.3727 1.7060 263.5204 45.3042 23.8453 12.3226 29.0625 0.9877 9.7355 0.5127 0.6284 102.6734 25.1012
temp: 298.150 k
press: 1.00000 atm
elementType: 17 7 7 7 7 7 6 6 6 6 6 6 6 6 6 6 6 6 1 1 1 1 1 1 1 1 1 1
symmnumber: 1
zpe: 538471.7 jmol-1
zpe.correction: 0.205093 hartree
zpe.thermalcorrener: 0.220257 hartree
zpe.thermalcorrenthalpy: 0.221201 hartree
zpe.thermalcorrgfe: 0.161888 hartree
zpe.sumelectzpe: -1195.845574 hartree
zpe.sumelectthermal: -1195.830410 hartree
zpe.sumelectthermalent: -1195.829466 hartree
zpe.sumelectthermalfe: -1195.888779 hartree
dipole: -9.4920 0.4134 -0.1286
dipole: 9.5019
quadrupole: -98.4095 -105.7634 -113.7874
quadrupole: 1.5834 -0.5279 -4.1663
quadrupole: 7.5773 0.2234 -7.8006 1.5834 -0.5279 -4.1663
hfenergy: -1196.0506667 hartree
pointgroup: C01[X(C12H10Cl1N5)]
dipole: -3.7276215 0.2801659 -0.0385921 debye
polarizability: 304.8523359|-7.5830328|174.7152663|-0.7796574|-1.6413208|80.2822733 unknown
InChI: InChI=1S/C12H10ClN5/c1-7-4-8(2-3-9(7)14)18-6-17-10-11(13)15-5-16-12(10)18/h2-6H,14H2,1H3
charge 0 multiplicity 1
28 atoms
Cl 5.34693 -1.009089 -0.038451
N  0.311665 -0.518371 -0.197759
N  2.137677 -1.925733 -0.393663
N  1.526191 1.603469 0.290321
N  -5.162769 0.974429 -0.116221
N  3.951073 1.287523 0.357007
C  -1.072404 -0.121294 -0.161247
C  1.447943 0.274467 0.018485
C  -2.053947 -1.041177 0.281542
C  -3.422513 -0.706963 0.30001
C  2.570441 -0.624638 -0.104036
C  -1.462037 1.174754 -0.571436
C  -3.817828 0.604649 -0.125067
C  0.799118 -1.818224 -0.444724
C  -2.820542 1.528961 -0.547509
C  -4.465214 -1.69868 0.778914
C  3.832668 -0.021139 0.084665
C  2.804863 2.042593 0.449316
H  -1.751401 -2.030621 0.64389
H  -0.708379 1.899765 -0.887094
H  0.127569 -2.639214 -0.684362
H  -3.117896 2.535652 -0.864143
H  -5.027687 -1.312846 1.653144
H  -5.20398 -1.934074 -0.013935
H  -4.001187 -2.650752 1.084811
H  -5.886627 0.329291 0.184032
H  -5.442024 1.909105 -0.400029
H  2.942701 3.102755 0.674442
