program: Gaussian 09
title: 000264799
version: EM64L-G09RevD.01
frameworkgroup: C1[X(C9H10Cl3NO)]
method: RPBEPBE
basis: SDD
operation: Freq
keyword: #p
keyword: freq=noraman
keyword: PBEPBE/SDD
title: #p freq=noraman PBEPBE/SDD
converged: YES YES NO NO
title: Mulliken charges:
elementType: Cl Cl Cl O N C C C C C C C C C H H H H H H H H H H
charge: 0.085346 0.121783 0.052053 -0.429645 -0.215501 -0.547078 0.089232 0.326064 -0.625109 -0.366200 0.188167 -0.151115 -0.344772 -0.772982 0.256800 0.238101 0.235740 0.248889 0.245160 0.244279 0.390515 0.228578 0.251243 0.250452
chargesum: 0.00000
title: Mulliken charges with hydrogens summed into heavy atoms:
elementType: Cl Cl Cl O N C C C C C C C C C
charge: 0.085346 0.121783 0.052053 -0.039130 -0.215501 -0.052176 0.324972 0.326064 -0.625109 -0.117311 0.188167 0.094045 -0.100493 -0.042710
polarizability: 1.68934071e+02 -4.09200431e-01 1.44996271e+02 2.74386925e+00 -1.10337175e+00 9.41506271e+01
1716.lowfreq: -2.6292 -2.1838 0.0013 0.0016 0.0022 6.8383 25.8607 42.2058 53.4999
frequency: 25.8354 42.1426 53.4817 80.0084 92.5945 143.5121 177.1224 192.0602 197.9562 230.5279 245.7090 274.5628 318.8183 332.7015 362.8923 398.2918 430.0494 486.9254 535.5854 548.2251 560.4564 633.8619 701.2694 721.9480 739.4699 765.0970 791.2276 850.6922 866.4887 905.7951 926.3975 979.6818 997.4296 1009.5966 1022.9903 1047.9636 1054.1842 1059.2356 1094.1815 1176.0051 1181.7630 1227.5698 1261.9424 1290.2520 1300.2758 1313.1410 1340.4251 1393.2663 1404.9952 1442.3237 1444.1374 1458.8609 1475.9886 1513.5402 1575.2132 1592.6054 2829.9622 2931.2100 2992.6977 2998.3505 3076.2580 3081.1580 3107.2593 3141.6778 3159.6893 3172.5565
redmass: 5.2328 2.6935 1.3516 5.7732 6.5477 8.6843 10.1266 5.6148 4.1528 4.4215 12.5236 6.1786 5.3390 11.0193 11.6552 3.6030 3.2225 2.5210 5.9365 5.4527 4.0714 4.6461 7.5686 9.6882 2.5189 4.1741 1.5197 1.3030 2.0712 1.3806 2.5768 5.7913 1.3806 2.6367 2.7075 1.6131 3.7496 3.6845 1.6080 1.1222 1.3232 1.4800 1.8763 2.6553 1.1622 2.2091 1.8135 1.6283 1.6792 1.4896 1.3748 1.0449 1.1948 1.3503 6.2050 5.4901 1.0699 1.0822 1.0372 1.0628 1.0973 1.0974 1.0999 1.0876 1.0931 1.1002
irintensity: 0.0956 0.1963 1.1619 2.2798 0.7333 0.5538 1.3776 1.2919 1.7342 3.7965 0.5810 0.4113 16.5413 0.9478 2.3136 6.8498 1.7756 11.7528 18.6244 20.8063 18.0212 24.0978 55.1072 161.0512 7.8517 108.9746 29.5818 44.9225 38.8504 1.8988 2.6890 3.1204 0.1998 3.0240 11.4829 15.7768 16.6429 32.4145 18.6000 4.5143 10.9180 10.8253 15.4131 7.3835 1.4747 2.9450 3.7101 16.1947 16.0438 100.1526 18.8026 15.9407 53.1569 173.9859 62.3824 43.5286 1130.4613 33.2015 10.1981 7.7614 9.5520 7.2518 15.6012 4.3894 13.6018 10.7741
temp: 298.150 k
press: 1.00000 atm
elementType: 17 17 17 8 7 6 6 6 6 6 6 6 6 6 1 1 1 1 1 1 1 1 1 1
symmnumber: 1
zpe: 453265.6 jmol-1
zpe.correction: 0.172640 hartree
zpe.thermalcorrener: 0.187208 hartree
zpe.thermalcorrenthalpy: 0.188152 hartree
zpe.thermalcorrgfe: 0.128764 hartree
zpe.sumelectzpe: -1858.056188 hartree
zpe.sumelectthermal: -1858.041620 hartree
zpe.sumelectthermalent: -1858.040676 hartree
zpe.sumelectthermalfe: -1858.100064 hartree
dipole: -6.8032 2.6149 -0.4029
dipole: 7.2996
quadrupole: -90.9796 -99.7861 -104.6482
quadrupole: 0.7676 1.2869 0.2280
quadrupole: 7.4917 -1.3148 -6.1769 0.7676 1.2869 0.2280
hfenergy: -1858.2288276 hartree
pointgroup: C01 [X(C9H10Cl3N1O1)]
dipole: 2.5836102 1.2499008 0.1017212 debye
dipolederiv: -0.2495312 -0.0461924 -0.1000462 -0.0688867 -0.1799778 -0.1446689 -0.1158439 -0.146649 -0.7673523 -0.3562638 -0.2330451 0.1882002 -0.2532464 -0.3956115 0.2424798 0.1948141 0.2640332 -0.3840817 -0.3407427 0.193992 0.0420021 0.226697 -0.7308744 -0.1052929 0.052958 -0.1102814 -0.2011314 -1.1610536 0.0801861 0.0221846 0.1724556 -0.598084 0.0153762 0.1301441 0.0131697 -0.4511179 -0.8289329 0.0774156 -0.0667072 -0.0098313 -0.4575694 0.0441161 -0.023555 0.0461713 -0.2187132 -0.3424845 -0.0883963 0.0203733 -0.0863644 -0.0113673 0.0361408 -0.1377724 0.0538796 -0.0019288 0.4839631 -0.1748573 -0.0517175 -0.2131297 0.2384308 0.0282689 -0.1910765 -0.0041372 0.140193 0.7543832 0.0150626 0.1325742 0.2013472 0.1199885 0.0508966 0.2616579 0.0278533 0.0513684 0.8216672 0.0979247 -0.1146476 0.0100959 1.3352475 0.0280475 -0.0968816 0.0326306 1.355247 -0.480235 -0.0287149 -0.0422399 -0.2667917 -0.0196964 -0.0584296 -0.0722242 -0.0258367 -0.1359312 0.2312212 -0.0558905 0.0384335 -0.4308559 0.6922162 -0.10759 0.0530826 -0.0747149 0.0657498 0.2633018 -0.0062249 0.0676521 -0.0358937 0.2266742 -0.0190221 0.0617917 -0.0270598 -0.0723215 -0.0315697 -0.0812683 0.0403903 0.2129274 -0.4407546 0.0552453 -0.0084502 0.0109127 -0.1428634 0.0703129 -0.0001451 0.0131975 0.1590689 -0.2687427 0.0531069 -0.0018698 0.0300184 0.0099338 0.064732 0.0015788 -0.0364219 0.0209797 0.0918257 -0.067256 0.0300027 -0.0154314 -0.0217656 0.0923141 0.0298608 0.0037635 0.0564785 -0.0803082 0.0051091 0.016615 -0.0179726 0.0963266 -0.0207596 0.0011923 -0.0429907 0.0380008 -0.0247985 -0.0622447 0.0511941 -0.0805621 -0.1257659 0.0550732 0.0882392 -0.0262635 0.0684459 -0.020958 0.0281206 -0.0207677 0.0272715 0.1507883 0.027463 -0.0885977 -0.0120328 -0.0918198 -0.0370656 -0.0030449 -0.0116821 -0.0043014 0.1430739 -0.0948425 0.0183394 -0.0464131 0.0218115 0.0946644 0.010936 -0.0467979 0.0113224 0.1511842 1.0366759 0.1692287 -0.0129004 0.3128804 0.3240312 -0.0140584 -0.1165379 -0.0055409 0.2751427 -0.1411166 0.0381249 -0.0494186 -0.0619589 0.0760461 -0.0084514 -0.0432376 0.0095794 0.109 0.0526931 -0.015934 0.0900677 -0.0009338 0.0489165 0.0579756 0.0544638 0.0882515 -0.0054953 0.0937316 0.0081215 -0.0570397 0.0185236 0.0177672 -0.0657604 -0.0200274 -0.1026062 -0.0195397 unknown
polarizability: 168.3593932|2.9134804|144.6003308|5.6101857|-5.5986439|95.1212453 unknown
InChI: InChI=1S/C9H10Cl3NO/c1-6-3-2-4-7(13-6)5-8(14)9(10,11)12/h2-4,8,14H,5H2,1H3
charge 0 multiplicity 1
24 atoms
Cl -3.275346 -0.835267 -1.861817
Cl -3.813079 -1.579307 1.016832
Cl -3.684386 1.334089 0.228138
O  -0.923038 -1.680614 0.097072
N  1.426595 -0.542338 -0.114809
C  -0.646432 0.661975 -0.662499
C  -1.43281 -0.337066 0.237416
C  0.837265 0.679213 -0.325215
C  -2.946392 -0.373586 -0.089126
C  1.589229 1.87574 -0.262038
C  2.763157 -0.631321 0.163752
C  2.971936 1.796542 0.01272
C  3.567684 0.533975 0.225994
C  3.318999 -2.017559 0.396602
H  -0.772381 0.332126 -1.712679
H  -1.064667 1.678458 -0.574449
H  -1.375725 0.006615 1.296839
H  1.098309 2.839945 -0.424438
H  3.577544 2.707536 0.063456
H  4.636694 0.445879 0.440646
H  0.096344 -1.56505 -0.014972
H  4.401454 -1.990665 0.601385
H  2.810941 -2.499261 1.251671
H  3.141306 -2.659159 -0.48498
