program: Gaussian 09
title: 000264783
version: EM64L-G09RevD.01
frameworkgroup: C1[X(C13H12N4O)]
method: RPBEPBE
basis: SDD
operation: Freq
keyword: #p
keyword: freq=noraman
keyword: PBEPBE/SDD
title: #p freq=noraman PBEPBE/SDD
converged: YES YES NO NO
title: Mulliken charges:
elementType: O N N N N C C C C C C C C C C C C C H H H H H H H H H H H H
charge: -0.199658 -0.189647 -0.370455 -0.027475 -0.002461 -0.191726 0.336179 0.410937 -0.708869 -0.127359 -0.226887 -0.353023 -0.403880 0.033714 -0.235152 -0.234072 -0.239659 -0.232073 0.206518 0.231902 0.234024 0.239303 0.291892 0.315099 0.249412 0.248731 0.236638 0.232785 0.237861 0.237403
chargesum: 0.00000
title: Mulliken charges with hydrogens summed into heavy atoms:
elementType: O N N N N C C C C C C C C C C C C C
charge: -0.199658 -0.189647 -0.055356 -0.027475 -0.002461 0.014792 0.336179 0.410937 -0.003640 -0.127359 0.065005 -0.103611 -0.155150 0.033714 0.001486 -0.001288 -0.001798 0.005330
polarizability: 2.34379972e+02 1.55594652e-01 1.45258777e+02 -1.35264932e+01 2.81131572e+00 1.18080157e+02
1716.lowfreq: -6.5769 -4.9171 -0.0009 -0.0008 -0.0005 4.8362 16.2808 32.3815 47.6921
frequency: 15.9968 32.3574 47.6824 89.5380 118.9291 151.1484 179.8869 217.5484 253.4311 261.7484 275.9640 326.7214 351.8683 402.1409 458.4749 463.8467 483.7057 486.9415 526.0815 533.0562 581.8964 614.4877 620.3089 640.9322 659.0736 664.4671 693.1894 706.1631 764.9750 770.1533 791.6973 798.0504 855.4860 860.0911 884.9146 926.9251 927.4776 972.6403 982.1605 991.9071 1002.1981 1006.3889 1029.0510 1048.0665 1076.3039 1077.3363 1112.9927 1145.2722 1177.2116 1182.4519 1196.5520 1213.7080 1264.4547 1295.5795 1320.0399 1328.8449 1331.7468 1357.5238 1359.0262 1383.7354 1396.6893 1417.8988 1438.8380 1474.7893 1479.9108 1486.9189 1509.5967 1529.3633 1592.3464 1595.6513 1615.7393 1637.0639 2949.4037 2996.3232 3092.9820 3101.9027 3118.6090 3124.8820 3134.1587 3146.4810 3157.1732 3170.7724 3246.3846 3534.7744
redmass: 4.6916 4.3125 6.2011 5.7403 5.3125 5.5698 4.5940 3.9166 4.5232 3.4943 1.1366 7.8183 4.4615 2.7958 3.7243 3.4139 10.5026 2.5771 5.4796 1.4162 6.1993 5.7616 4.7974 3.6936 11.9763 5.6413 4.8791 1.6396 2.4622 3.8691 2.4216 1.8026 1.2503 7.4680 1.4598 3.2718 1.7542 2.8877 1.3998 5.8439 1.3682 2.3926 2.2940 1.9801 2.3931 2.2604 1.9302 3.2521 1.0519 2.1752 1.1223 2.1722 2.6140 1.6091 4.1399 2.7621 1.3480 1.4646 1.4081 7.8175 1.2126 3.7840 2.1885 1.0565 1.0583 2.2273 4.1880 8.2940 6.3659 6.1354 5.9647 12.4037 1.0831 1.0360 1.1001 1.1008 1.0925 1.0875 1.0866 1.0918 1.0955 1.1014 1.0986 1.0791
irintensity: 0.5294 0.3176 5.0069 1.0796 2.2561 2.5267 1.6051 1.0657 1.0468 3.6513 0.8113 1.2822 0.4959 0.2467 7.7483 6.6338 1.6827 34.6828 1.3979 63.0644 5.9666 1.1402 4.2234 10.0191 6.3347 27.2133 7.0473 48.1842 19.8659 11.3310 31.2461 7.4657 0.0658 7.6228 11.7527 40.7008 12.3730 11.8314 0.0727 1.5071 0.7396 25.5565 5.9886 1.3010 19.3701 22.3723 1.6775 27.7060 0.0250 71.7230 1.7440 25.2320 0.3893 15.6891 43.3406 17.0808 2.2296 17.1537 9.7386 1.3617 18.4729 6.7670 15.9406 14.0725 7.0638 13.3404 17.1965 366.7481 60.5459 21.6852 4.7000 402.1330 21.6275 10.9410 30.0988 18.4900 23.0435 7.0668 0.0655 13.9941 28.3000 16.0845 0.5050 22.5706
temp: 298.150 k
press: 1.00000 atm
elementType: 8 7 7 7 7 6 6 6 6 6 6 6 6 6 6 6 6 6 1 1 1 1 1 1 1 1 1 1 1 1
symmnumber: 1
zpe: 605556.9 jmol-1
zpe.correction: 0.230644 hartree
zpe.thermalcorrener: 0.245435 hartree
zpe.thermalcorrenthalpy: 0.246379 hartree
zpe.thermalcorrgfe: 0.186810 hartree
zpe.sumelectzpe: -795.532224 hartree
zpe.sumelectthermal: -795.517434 hartree
zpe.sumelectthermalent: -795.516489 hartree
zpe.sumelectthermalfe: -795.576058 hartree
dipole: 10.0519 7.4084 2.6664
dipole: 12.7685
quadrupole: -134.7286 -102.5256 -101.2353
quadrupole: -22.1841 -9.4659 -4.1926
quadrupole: -21.8987 10.3042 11.5945 -22.1841 -9.4659 -4.1926
hfenergy: -795.7628681 hartree
pointgroup: C01 [X(C13H12N4O1)]
dipole: -4.0960708 -0.950513 -2.748541 debye
polarizability: 232.9828135|-18.1971777|119.5601552|-2.4424904|4.056691|145.1759375 unknown
InChI: InChI=1S/C13H12N4O/c1-9(10-5-3-2-4-6-10)17-8-16-11-12(17)14-7-15-13(11)18/h2-9,14H,1H3
charge 0 multiplicity 1
30 atoms
O  4.515279 0.350653 1.481415
N  0.157654 0.245346 -0.263751
N  1.932467 -1.069637 -1.462289
N  1.485255 1.104803 1.397625
N  4.131187 -0.936896 -0.461296
C  -1.019335 0.06354 -1.16452
C  1.445175 -0.231959 -0.470896
C  -2.309341 -0.057897 -0.33883
C  -1.026458 1.163963 -2.24765
C  2.264224 0.288828 0.55295
C  0.24786 1.065313 0.887109
C  -2.378713 -1.039437 0.685216
C  -3.443189 0.751217 -0.587792
C  3.694857 -0.048054 0.618462
C  -3.55523 -1.206931 1.443498
C  -4.624887 0.583874 0.171925
C  3.306111 -1.376612 -1.380131
C  -4.68556 -0.394295 1.18797
H  -0.863665 -0.916368 -1.665835
H  -1.820731 0.979069 -2.991473
H  -0.058872 1.186144 -2.778481
H  -1.185545 2.159677 -1.799455
H  -0.622576 1.572113 1.294787
H  1.352722 -1.458538 -2.20819
H  -1.502871 -1.664635 0.897498
H  -3.417369 1.517751 -1.368635
H  -3.591425 -1.965377 2.232816
H  -5.494027 1.219177 -0.030319
H  3.671631 -2.041149 -2.173543
H  -5.600331 -0.522685 1.776514
