program: Gaussian 09
title: 000264773
version: EM64L-G09RevD.01
frameworkgroup: C1[X(C13H10Cl2N4)]
method: RPBEPBE
basis: SDD
operation: Freq
keyword: #p
keyword: freq=noraman
keyword: PBEPBE/SDD
title: #p freq=noraman PBEPBE/SDD
converged: YES YES NO NO
title: Mulliken charges:
elementType: Cl Cl N N N N C C C C C C C C C C C C C H H H H H H H H H H
charge: -0.067746 0.029469 -0.262600 -0.014889 -0.017977 0.065373 0.452297 0.481190 0.110665 -0.343663 -0.370397 -0.512320 -0.395769 -0.402769 0.129172 -0.219823 -0.579545 -0.307331 -0.355547 0.288682 0.243674 0.239826 0.237888 0.244244 0.243989 0.277244 0.273060 0.275192 0.258412
chargesum: 0.00000
title: Mulliken charges with hydrogens summed into heavy atoms:
elementType: Cl Cl N N N N C C C C C C C C C C C C C
charge: -0.067746 0.029469 -0.262600 -0.014889 -0.017977 0.065373 0.452297 0.481190 0.110665 -0.054981 -0.126724 -0.034607 -0.151525 -0.158780 0.129172 0.057421 -0.031292 -0.307331 -0.097135
polarizability: 3.27860687e+02 -3.39187781e+00 1.73453663e+02 1.00499018e+01 1.05786480e+01 8.88861923e+01
1716.lowfreq: -3.6212 -0.0014 -0.0007 -0.0006 2.0735 6.1978 24.7745 25.8239 39.3920
frequency: 24.7254 25.7934 39.3632 59.2830 78.4754 97.0244 133.3926 169.5444 190.3478 214.2200 240.4604 262.6108 304.9882 341.3462 376.2264 384.1819 405.5025 411.7684 522.7090 545.8620 553.9045 572.4913 623.4979 630.3391 640.5744 650.4086 665.8796 681.3168 743.6817 782.3617 787.9754 797.8616 813.1102 837.0831 840.3721 848.7273 888.2072 916.2973 958.0113 973.4455 981.6505 984.0416 1016.0171 1040.2249 1099.9183 1109.0321 1134.0662 1153.4398 1168.8633 1199.9645 1217.0734 1233.9399 1253.6058 1266.4804 1269.4520 1301.4394 1308.5853 1321.4228 1326.4900 1367.2221 1385.2228 1398.2606 1422.4661 1444.2675 1456.7934 1481.3420 1497.1675 1512.5702 1557.3536 1589.3577 1623.9399 3015.1266 3056.8600 3074.0965 3129.6807 3134.1179 3141.8505 3156.8571 3185.1952 3186.3223 3241.8241
redmass: 6.8190 10.7728 4.4987 6.7879 2.5757 6.7579 8.5682 13.7154 8.2618 7.6344 5.4566 5.4994 5.2412 5.0638 4.5308 11.3678 2.9486 4.9435 3.2647 4.5839 6.3245 7.5841 7.3480 6.7642 5.6550 6.0484 7.6748 4.6182 4.2124 1.1354 6.4465 7.4470 4.0641 1.2922 1.5857 1.7679 8.7327 1.4357 1.3776 1.4015 3.0941 2.0259 2.7641 4.4719 1.3301 5.7111 1.6032 2.0934 4.6035 1.1414 2.4723 2.6737 1.2288 1.2675 2.5802 3.8566 4.9596 1.3513 1.3322 5.2212 7.0632 1.7861 3.0094 4.4348 1.0878 1.1030 8.3781 2.8419 10.7987 7.3338 6.3304 1.0599 1.0563 1.1036 1.0890 1.0909 1.1117 1.0960 1.0950 1.0930 1.0985
irintensity: 0.5195 0.8415 0.8537 0.2186 2.6445 0.5187 0.0601 0.5435 0.2464 3.2876 4.5648 1.9194 1.9200 6.6562 3.9029 4.0580 0.3260 0.4113 17.8329 8.5541 23.6217 4.9931 5.3366 6.6633 14.1999 12.7094 4.9243 47.4612 27.8062 2.9821 5.0769 31.8818 19.2248 2.1296 21.6288 36.6348 113.7698 12.6925 0.2950 1.4834 5.6383 4.9220 14.3339 20.7143 0.9055 22.7714 6.7638 19.6112 106.1274 2.7156 1.5721 126.0086 9.2179 0.9505 0.0675 24.3032 149.1697 20.8741 4.4716 19.7530 15.0768 68.1399 12.7131 124.2335 2.5521 17.1399 191.9218 121.7639 121.8827 5.3573 6.4467 13.9413 19.1406 5.6597 10.4359 13.9483 14.3697 6.8596 0.8135 7.4140 0.6731
temp: 298.150 k
press: 1.00000 atm
elementType: 17 17 7 7 7 7 6 6 6 6 6 6 6 6 6 6 6 6 6 1 1 1 1 1 1 1 1 1 1
symmnumber: 1
zpe: 547153.8 jmol-1
zpe.correction: 0.208400 hartree
zpe.thermalcorrener: 0.224444 hartree
zpe.thermalcorrenthalpy: 0.225389 hartree
zpe.thermalcorrgfe: 0.161530 hartree
zpe.sumelectzpe: -1639.180388 hartree
zpe.sumelectthermal: -1639.164343 hartree
zpe.sumelectthermalent: -1639.163399 hartree
zpe.sumelectthermalfe: -1639.227258 hartree
dipole: 3.4405 -1.1334 0.5947
dipole: 3.6709
quadrupole: -170.6946 -118.3685 -123.4025
quadrupole: -5.8017 0.6804 3.6086
quadrupole: -33.2061 19.1201 14.0860 -5.8017 0.6804 3.6086
hfenergy: -1639.3887877 hartree
pointgroup: C01 [X(C13H10Cl2N4)]
dipole: -1.37146 -0.3982262 -0.2152629 debye
polarizability: 328.0924688|-2.2824203|173.2356216|6.9538062|-11.5692183|88.8724518 unknown
InChI: InChI=1S/C13H10Cl2N4/c14-6-5-9-1-3-10(4-2-9)19-8-18-11-12(15)16-7-17-13(11)19/h1-4,7-8H,5-6H2
charge 0 multiplicity 1
29 atoms
Cl -7.247864 0.921309 0.678819
Cl 5.921102 -0.387938 0.323234
N  0.890667 -0.723738 -0.095003
N  2.908899 -1.841262 0.054277
N  1.753584 1.616232 -0.021029
N  4.188569 1.69838 0.19192
C  -0.534419 -0.547267 -0.183002
C  -3.355617 -0.246667 -0.392777
C  1.886271 0.264866 -0.015802
C  -1.076979 0.609647 -0.792211
C  -1.394426 -1.545847 0.33517
C  -4.86633 -0.065004 -0.469359
C  -2.475651 0.749956 -0.886581
C  -2.790379 -1.393968 0.219501
C  3.129893 -0.45532 0.085987
C  1.577689 -1.95807 -0.055091
C  -5.370494 0.695571 0.770268
C  4.278724 0.358604 0.189818
C  2.944123 2.271034 0.088312
H  -0.411621 1.389957 -1.168248
H  -0.985219 -2.425251 0.843128
H  -5.147147 0.501335 -1.375237
H  -5.376463 -1.043341 -0.521148
H  -2.888208 1.64634 -1.364545
H  -3.448391 -2.175675 0.616852
H  1.052676 -2.906357 -0.141719
H  -5.185963 0.144948 1.704799
H  -4.955443 1.712307 0.837163
H  2.911919 3.363018 0.093304
