program: Gaussian 09
title: 000024879
version: EM64L-G09RevD.01
frameworkgroup: C1[X(C24H34N2)]
method: RPBEPBE
basis: SDD
operation: Freq
keyword: #p
keyword: freq=noraman
keyword: PBEPBE/SDD
title: #p freq=noraman PBEPBE/SDD
converged: YES YES NO NO
title: Mulliken charges:
elementType: N N C C C C C C C C C C C C C C C C C C C C C C C C H H H H H H H H H H H H H H H H H H H H H H H H H H H H H H H H H H
charge: -0.117121 -0.129990 -0.121048 -0.637438 -0.454082 -0.577025 -0.431961 0.385017 0.403614 0.381667 0.397597 -0.359531 -0.561224 -0.548072 -0.351416 -0.497902 -0.476856 -0.461303 -0.465271 -0.242619 -0.225959 -0.228241 -0.220321 -0.552155 -0.551909 -0.535260 0.250128 0.256879 0.202790 0.256526 0.284611 0.291726 0.267665 0.288924 0.281421 0.257463 0.268247 0.293279 0.266452 0.299733 0.265459 0.285366 0.309508 0.255763 0.250433 0.266100 0.259953 0.248946 0.250797 0.254053 0.253672 0.280992 0.290401 0.266870 0.277819 0.291741 0.265843 0.275127 0.287045 0.277078
chargesum: 2.00000
title: Mulliken charges with hydrogens summed into heavy atoms:
elementType: N N C C C C C C C C C C C C C C C C C C C C C C C C
charge: -0.117121 -0.129990 0.129080 -0.380559 0.005233 -0.292415 0.127429 0.385017 0.403614 0.381667 0.397597 0.210814 0.257766 0.283572 0.243458 -0.242139 -0.226424 -0.195203 -0.205318 0.006328 0.024838 0.025811 0.033351 0.286108 0.283494 0.303990
polarizability: 2.99048656e+02 -2.70144371e+01 2.46507040e+02 -7.14845341e+00 -1.08240405e+01 2.26157745e+02
1716.lowfreq: -6.3105 -3.8059 0.0005 0.0008 0.0010 4.6760 14.2287 19.6156 27.7905
frequency: 13.6173 19.1309 27.6941 56.6156 63.0119 73.3165 81.6659 124.5990 135.2760 146.6580 160.1352 175.4983 186.6692 192.4231 207.7473 235.0072 255.0657 266.6369 274.1272 289.6409 296.9022 308.0529 338.2352 343.2622 348.3795 365.0507 370.3499 398.0235 423.2194 429.8326 433.1925 444.9054 448.8371 476.7412 481.4444 496.4659 509.1755 532.4320 568.8723 575.0521 606.3039 619.6302 641.6402 706.9132 722.8682 733.3034 752.4411 761.8277 773.4142 775.3323 785.8971 791.6140 815.4195 820.6400 842.6830 857.3897 872.5126 880.5375 886.3908 896.1378 907.1894 908.4520 919.9126 931.5752 940.1925 954.8451 957.8199 961.4965 968.7495 999.2680 1003.7648 1022.5274 1025.3303 1036.2842 1041.5470 1043.6633 1053.9766 1069.2276 1091.3778 1098.4674 1110.5394 1118.4744 1120.4472 1139.5592 1140.6395 1168.3352 1171.8922 1177.8129 1179.1445 1181.0624 1190.3736 1197.6770 1204.5168 1211.2985 1213.5842 1214.7663 1225.1846 1226.0958 1245.0885 1252.7755 1272.2800 1284.2870 1298.4602 1312.4008 1321.8005 1330.0965 1334.5616 1337.6261 1353.7998 1365.1406 1391.9886 1394.4669 1398.9887 1418.9912 1424.4043 1427.2352 1441.8393 1445.6197 1446.9105 1450.1580 1452.7237 1454.6447 1455.3678 1459.3967 1461.5499 1464.0127 1465.5258 1469.4066 1473.0302 1478.9979 1481.6351 1487.3170 1488.9621 1490.0294 1497.2370 1500.4943 1592.2626 1600.5311 1609.3774 1618.2177 2985.8737 2995.0415 3002.8285 3026.3947 3026.9270 3027.2512 3028.4961 3029.0844 3031.0747 3032.9245 3038.7206 3058.9057 3068.4038 3081.0561 3096.6616 3113.8285 3117.7753 3129.3055 3136.8821 3139.0649 3142.3331 3143.8302 3145.6229 3146.1789 3146.7928 3148.9314 3151.0894 3151.3112 3152.1710 3154.2322 3155.9123 3167.0112 3169.6271 3175.1245
redmass: 4.1958 2.7633 4.3509 3.7592 4.4029 2.3622 2.4438 2.7974 3.1933 3.4513 2.7327 2.8957 1.6233 2.1710 1.5391 2.2074 1.2238 1.0862 1.3753 1.6991 2.4823 2.6167 2.7839 2.1474 4.1382 3.0360 3.4967 2.5942 3.3370 2.6778 2.2711 2.8751 3.0989 2.8128 3.3774 3.9544 3.2500 3.0804 3.6006 3.6141 4.5537 4.7336 6.6209 4.8932 4.9239 4.0482 4.1725 2.0818 2.0072 1.5589 1.4149 2.3326 3.4350 2.6690 3.1270 2.8699 2.9306 3.1058 1.3531 1.7318 3.2150 2.5755 2.8549 2.5264 2.6590 2.2660 1.4491 1.8619 2.2958 1.3279 1.3366 2.2925 2.2583 1.9269 1.1955 1.5055 2.3593 2.2821 1.3027 1.8532 1.5165 1.7432 1.6294 1.2041 1.4311 2.1361 2.2245 1.0996 1.4563 1.0853 1.3109 1.4261 1.6270 1.6017 1.6626 1.9109 1.7069 1.6545 1.9089 1.6585 1.3338 1.6981 1.3991 1.3821 1.3028 1.4067 1.1724 1.4070 1.2948 1.2176 6.3142 6.5160 1.2184 1.1381 1.1449 1.1696 1.1299 1.2151 1.8391 1.1186 2.3166 1.0470 1.0675 1.1007 1.0489 2.2961 1.0965 1.0714 1.0751 1.1762 2.0223 1.0667 1.0651 1.0525 1.0564 1.0632 6.2202 6.9558 6.8791 7.0490 1.0635 1.0823 1.0588 1.0370 1.0345 1.0385 1.0421 1.0810 1.0353 1.0426 1.0567 1.1014 1.0885 1.1079 1.1067 1.0895 1.1079 1.0895 1.0890 1.0899 1.1055 1.1059 1.1057 1.1059 1.1058 1.0931 1.1067 1.1039 1.1060 1.1056 1.0930 1.1049 1.0999 1.1001
irintensity: 1.5247 0.1564 2.3918 3.2876 0.4888 0.2080 1.3372 1.2865 0.0320 0.3068 1.4968 0.6051 2.7524 1.5733 2.3285 1.4818 0.0333 0.0299 0.2827 0.0307 0.1942 0.6254 0.4338 0.0444 2.8345 0.5801 0.3360 0.4416 1.6818 0.7173 1.1160 1.5714 1.9872 0.1715 1.9019 0.8410 3.1069 2.7632 30.9139 6.8852 2.5079 12.7818 1.3800 4.1498 3.8816 3.4783 0.1101 8.7026 52.8879 59.9347 10.8620 41.1523 1.4756 5.3932 20.0375 26.7642 10.0007 11.1496 1.8065 6.6049 5.5275 17.6654 25.3451 14.2117 11.8119 3.5940 0.1595 0.2754 0.9605 0.0134 0.0149 3.2171 1.6552 1.2779 0.0304 0.4244 1.3046 3.0244 0.5413 1.2961 2.2495 5.8360 3.4862 15.8691 1.4922 3.7549 3.9282 0.7044 0.6591 0.4516 0.5761 2.4990 1.5023 2.2761 0.7572 1.5482 1.7226 3.6950 3.3914 1.6958 4.5262 2.9983 0.3375 0.5251 0.3399 0.0425 0.9059 1.4149 8.4564 2.5387 0.3869 0.3093 0.6811 40.4233 14.7188 12.6489 9.4747 5.8137 8.4831 5.1193 0.4713 0.7672 10.1793 2.6937 2.7839 28.5466 20.6044 3.8006 31.4966 29.3807 18.0194 16.7141 51.9454 36.3564 88.6861 95.6494 0.1627 0.1470 0.8312 1.2102 45.1330 46.7410 25.6619 0.9491 0.4817 0.6562 1.1038 33.7684 3.3214 6.3214 2.7295 22.6907 12.3145 7.3320 1.7590 7.9986 2.0060 6.2451 0.3856 1.0843 1.4752 0.2053 6.0254 0.7019 0.9541 10.3654 1.0500 1.6114 4.2778 2.6972 8.8833 0.7764 13.0357 12.5724
temp: 298.150 k
press: 1.00000 atm
elementType: 7 7 6 6 6 6 6 6 6 6 6 6 6 6 6 6 6 6 6 6 6 6 6 6 6 6 1 1 1 1 1 1 1 1 1 1 1 1 1 1 1 1 1 1 1 1 1 1 1 1 1 1 1 1 1 1 1 1 1 1
symmnumber: 1
zpe: 1396695.4 jmol-1
zpe.correction: 0.531973 hartree
zpe.thermalcorrener: 0.556939 hartree
zpe.thermalcorrenthalpy: 0.557883 hartree
zpe.thermalcorrgfe: 0.476777 hartree
zpe.sumelectzpe: -1041.906152 hartree
zpe.sumelectthermal: -1041.881186 hartree
zpe.sumelectthermalent: -1041.880242 hartree
zpe.sumelectthermalfe: -1041.961348 hartree
dipole: -26.8601 -5.0922 -0.5898
dipole: 27.3449
quadrupole: 21.4137 -114.9066 -127.3338
quadrupole: -2.5605 -9.7002 0.8014
quadrupole: 95.0226 -41.2977 -53.7249 -2.5605 -9.7002 0.8014
hfenergy: -1042.4381248 hartree
pointgroup: C01 [X(C24H34N2)]
dipole: -10.6793926 -0.9926049 -0.8404593 debye
polarizability: 295.051931|-26.9440148|254.9251516|-15.3829301|-1.5014391|221.7363586 unknown
InChI: InChI=1S/C24H34N2/c1-25(2,3)14-15-26(4,5)17-18-16-23-19-10-6-8-12-21(19)24(18)22-13-9-7-11-20(22)23/h6-13,18,23-24H,14-17H2,1-5H3
charge 2 multiplicity 1
60 atoms
N  -2.158657 -1.436379 -0.980941
N  -5.299435 0.568704 0.424768
C  0.420545 -1.090249 -0.450162
C  1.25266 -0.635582 0.835147
C  1.103398 -0.474974 -1.728329
C  2.326275 0.424817 -1.303714
C  -1.036463 -0.622242 -0.237683
C  1.21256 0.891933 0.843694
C  2.69223 -1.084973 0.600971
C  1.788564 1.466386 -0.323743
C  3.282386 -0.496051 -0.54764
C  -3.480495 -0.633108 -0.980299
C  -2.340286 -2.801115 -0.311031
C  -1.797495 -1.673543 -2.454856
C  -3.974875 -0.233446 0.429626
C  0.694459 1.711714 1.865958
C  3.425012 -1.974387 1.409598
C  1.839598 2.866116 -0.470395
C  4.612264 -0.7950 -0.896047
C  0.753861 3.121762 1.720817
C  4.765965 -2.272735 1.062598
C  1.31988 3.694031 0.557248
C  5.354813 -1.686785 -0.082438
C  -5.15432 1.892931 -0.337522
C  -6.454069 -0.245704 -0.172346
C  -5.637036 0.888832 1.893374
H  0.475684 -2.196529 -0.477505
H  0.824466 -1.08041 1.752401
H  0.391135 0.149298 -2.302163
H  1.466017 -1.273613 -2.399529
H  2.789365 0.879869 -2.194556
H  -1.148234 0.428166 -0.561308
H  -1.299204 -0.69889 0.833283
H  -3.281988 0.259636 -1.595747
H  -4.220973 -1.265305 -1.499265
H  -2.557616 -2.673128 0.759632
H  -3.154743 -3.349368 -0.810255
H  -1.404343 -3.368192 -0.414487
H  -1.654084 -0.706019 -2.957318
H  -0.864863 -2.250523 -2.504726
H  -2.612383 -2.239392 -2.933829
H  -4.166884 -1.121349 1.054902
H  -3.239517 0.40916 0.940214
H  0.302513 1.269769 2.790867
H  2.976977 -2.419824 2.30552
H  2.301691 3.315672 -1.356408
H  5.075778 -0.338644 -1.77764
H  0.393329 3.771545 2.525473
H  5.35343 -2.952356 1.688133
H  1.383359 4.783041 0.462512
H  6.394206 -1.918006 -0.336562
H  -4.289158 2.447695 0.057451
H  -6.069618 2.484252 -0.184258
H  -5.032882 1.699288 -1.413289
H  -6.537198 -1.205275 0.361063
H  -7.385951 0.32566 -0.045469
H  -6.284044 -0.41318 -1.245897
H  -5.75125 -0.051271 2.454475
H  -6.580934 1.453215 1.923184
H  -4.828426 1.496555 2.327449
