program: Gaussian 09
title: 000264780
version: EM64L-G09RevD.01
frameworkgroup: C1[X(C12H8ClN5O2)]
method: RPBEPBE
basis: SDD
operation: Freq
keyword: #p
keyword: freq=noraman
keyword: PBEPBE/SDD
title: #p freq=noraman PBEPBE/SDD
converged: YES YES NO NO
title: Mulliken charges:
elementType: Cl O O N N N N N C C C C C C C C C C C C H H H H H H H H
charge: 0.040974 -0.203841 -0.200259 -0.268332 -0.003909 -0.028129 0.021902 0.069113 0.493025 0.127228 -0.551625 0.402147 -0.342185 0.129612 0.216706 -0.207177 -0.384920 -0.772657 -0.307761 -0.350822 0.245404 0.311518 0.274072 0.293731 0.256816 0.262792 0.214368 0.262208
chargesum: 0.00000
title: Mulliken charges with hydrogens summed into heavy atoms:
elementType: Cl O O N N N N N C C C C C C C C C C C C
charge: 0.040974 -0.203841 -0.200259 -0.268332 -0.003909 -0.028129 0.021902 0.069113 0.493025 0.127228 -0.306221 0.402147 -0.030666 0.129612 0.216706 0.066895 -0.091188 -0.038680 -0.307761 -0.088614
polarizability: 3.33963659e+02 3.45863078e-01 1.92941513e+02 -3.45905066e-01 6.33813828e-01 7.51032978e+01
1716.lowfreq: -5.8210 -1.8914 -0.0017 -0.0017 -0.0015 5.5600 18.6495 25.3225 33.6838
frequency: 18.5881 25.2946 33.6808 68.2548 97.7834 151.5631 176.0939 196.2560 206.1405 225.3999 238.3548 261.3685 271.3421 312.4180 340.1368 382.4277 395.0754 442.4045 458.0786 514.3827 534.7916 553.2710 558.7253 576.1967 612.7139 625.2132 644.1517 659.3879 673.4844 682.4426 733.2522 765.5302 787.7567 799.2792 836.7977 853.8929 858.7888 880.4365 896.0690 918.6174 993.6564 996.8214 1039.0692 1043.0006 1065.6541 1108.0496 1129.2330 1163.2903 1171.3418 1197.6317 1206.8521 1246.0182 1263.4651 1286.5489 1307.0304 1311.1552 1360.5155 1370.3403 1385.6201 1397.0452 1407.1249 1424.5112 1449.6911 1453.4828 1469.8411 1489.6385 1502.1139 1554.7284 1584.6321 1617.9282 2999.0559 3086.5252 3099.1170 3154.6076 3180.0454 3188.7052 3195.8517 3247.1186
redmass: 10.9679 4.3809 13.1480 9.3639 8.5962 7.1085 15.3424 3.4694 8.6425 1.1459 4.5803 6.5240 6.0201 5.7110 6.0656 16.4396 5.6791 2.9935 6.7872 5.4750 4.4007 7.0493 5.9219 5.1386 8.5462 7.0151 4.7219 5.9924 4.5690 7.5926 4.5943 9.1048 5.9284 11.0791 1.6495 2.2278 2.3978 1.5240 7.6379 1.4420 1.8493 1.4114 2.0520 1.6725 5.3408 5.0391 4.6193 3.3067 2.1438 2.2961 4.8208 3.8271 2.0760 1.8730 3.0169 5.4099 5.2202 4.5718 4.1236 1.7332 1.5786 2.6670 3.7034 1.0800 1.4438 2.2542 8.5432 10.3175 7.7367 6.4023 1.0367 1.0961 1.1014 1.0914 1.0895 1.0932 1.0973 1.0983
irintensity: 0.0505 0.5898 1.8768 1.6123 2.3477 1.7432 1.6150 1.0581 2.1139 0.7030 2.3284 0.3868 0.9772 0.8405 0.2928 10.3711 0.4851 4.0243 4.8766 3.3200 1.1900 12.7963 3.7019 2.2828 4.5297 8.3408 11.2239 3.1757 14.3556 0.5099 1.8732 20.1627 9.3912 59.9977 18.1818 23.3362 40.6083 33.8253 89.2172 12.3271 17.3620 0.4108 5.6119 10.6796 42.8473 19.1687 40.4857 116.3503 30.4398 76.9290 452.4818 94.5991 0.7735 4.5239 52.4540 144.8400 85.3107 94.0489 1.1765 81.3763 44.2885 19.3477 132.5410 20.5973 30.8692 183.0276 92.7467 181.9937 54.9807 148.6465 9.9897 4.9914 20.7525 7.8366 6.4677 5.9684 4.6710 0.9019
temp: 298.150 k
press: 1.00000 atm
elementType: 17 8 8 7 7 7 7 7 6 6 6 6 6 6 6 6 6 6 6 6 1 1 1 1 1 1 1 1
symmnumber: 1
zpe: 498919.9 jmol-1
zpe.correction: 0.190029 hartree
zpe.thermalcorrener: 0.206220 hartree
zpe.thermalcorrenthalpy: 0.207164 hartree
zpe.thermalcorrgfe: 0.143575 hartree
zpe.sumelectzpe: -1344.863693 hartree
zpe.sumelectthermal: -1344.847502 hartree
zpe.sumelectthermalent: -1344.846558 hartree
zpe.sumelectthermalfe: -1344.910146 hartree
dipole: -0.2770 -1.9191 0.0503
dipole: 1.9396
quadrupole: -172.1607 -116.4740 -120.7160
quadrupole: 14.0650 -1.0283 -1.8973
quadrupole: -35.7104 19.9763 15.7342 14.0650 -1.0283 -1.8973
hfenergy: -1345.0537216 hartree
pointgroup: C01 [X(C12H8Cl1N5O2)]
dipole: -0.1222294 0.7516908 -0.0483604 debye
polarizability: 333.9247492|2.1926263|192.8575821|1.3190051|-3.7475772|75.2261388 unknown
InChI: InChI=1S/C12H8ClN5O2/c1-7-4-8(2-3-9(7)18(19)20)17-6-16-10-11(13)14-5-15-12(10)17/h2-6H,1H3
charge 0 multiplicity 1
28 atoms
Cl 5.957776 0.770592 0.037666
O  -4.953201 -1.936814 0.182018
O  -5.579387 0.240617 -0.01302
N  0.903455 0.589532 0.107989
N  2.807976 1.894646 0.247539
N  2.005106 -1.636581 -0.167316
N  -4.675565 -0.67953 0.069715
N  4.443599 -1.467733 -0.202532
C  -0.494191 0.273281 0.072838
C  1.999604 -0.288951 -0.007955
C  -1.432671 1.288054 -0.231804
C  -2.828639 1.050158 -0.244263
C  -0.936448 -1.046697 0.341126
C  3.167072 0.547508 0.070107
C  -3.243776 -0.284762 0.045592
C  1.470765 1.879362 0.264231
C  -2.311546 -1.313462 0.320293
C  -3.750755 2.204272 -0.583433
C  4.398361 -0.134492 -0.039595
C  3.260725 -2.160974 -0.259758
H  -1.088545 2.293534 -0.492289
H  -0.213624 -1.839963 0.539187
H  0.856085 2.761945 0.420583
H  -2.690088 -2.318818 0.519893
H  -4.425988 1.95713 -1.420131
H  -4.410885 2.453622 0.264712
H  -3.160125 3.096281 -0.851996
H  3.338011 -3.24276 -0.389798
