program: Gaussian 09
title: 000264756
version: EM64L-G09RevD.01
frameworkgroup: C1[X(C9H3Cl4IO)]
method: RPBEPBE
basis: SDD
operation: Freq
keyword: #p
keyword: freq=noraman
keyword: PBEPBE/SDD
title: #p freq=noraman PBEPBE/SDD
converged: YES YES NO NO
title: Mulliken charges:
elementType: I Cl Cl Cl Cl O C C C C C C C C C H H H
charge: 0.185386 0.046215 0.010572 0.051893 0.018289 -0.246311 0.582270 -0.222673 -0.288662 -0.084405 -0.238083 -0.099205 -0.364473 0.403649 -0.541869 0.288560 0.249566 0.249283
chargesum: 0.00000
title: Mulliken charges with hydrogens summed into heavy atoms:
elementType: I Cl Cl Cl Cl O C C C C C C C C C
charge: 0.185386 0.046215 0.010572 0.051893 0.018289 -0.246311 0.582270 -0.222673 -0.288662 -0.084405 0.050477 -0.099205 0.134375 0.403649 -0.541869
polarizability: 2.83532263e+02 2.39007224e+00 1.54449082e+02 -1.37402652e+01 8.02253362e-01 6.20993282e+01
1716.lowfreq: -6.3472 -0.0009 -0.0007 0.0026 1.7882 2.7368 11.3346 24.7698 38.3185
frequency: 11.0517 24.7580 38.0768 61.8331 73.9490 113.8823 148.3040 153.1443 180.6794 191.8404 202.6213 221.4258 267.5618 275.6839 311.1555 332.4290 335.1514 351.3785 391.3773 408.0001 516.0011 519.4757 536.4813 601.3279 622.3424 703.0437 743.7179 771.5195 835.8224 852.0656 905.7604 970.6725 1056.4399 1060.4081 1155.1901 1194.6039 1216.8776 1312.0734 1338.9700 1349.7324 1403.8166 1458.0099 1535.0756 1558.9999 2237.7336 2972.9656 3028.9025 3185.6180
redmass: 16.0523 21.6120 4.2766 18.3250 25.7055 16.4104 10.6834 3.9020 21.5751 18.4968 28.5750 11.8903 12.9204 8.4794 24.5905 5.8417 11.1476 29.3041 10.8967 9.2523 6.3437 6.2698 7.6322 10.7393 10.6122 10.0379 10.1456 10.8836 10.9315 1.4002 9.9774 1.6030 5.7198 5.9845 1.8579 1.0520 4.5789 5.0497 3.5139 2.3670 3.1558 1.1038 10.3921 8.9966 11.8393 1.0548 1.1070 1.0932
irintensity: 0.0148 0.0822 2.8172 0.4482 0.1934 0.6503 1.0318 11.8302 0.1864 0.3826 0.1068 2.1622 1.2912 4.4983 0.1646 1.2336 2.3591 0.2903 7.0637 0.2584 7.9635 11.8442 1.3551 14.7000 10.7521 26.2236 69.9227 41.6051 75.6383 21.1885 115.6711 0.0849 84.4065 11.3929 43.2490 2.4992 79.0634 143.7804 68.4773 80.8561 142.9457 4.8639 13.7502 10.7476 105.8223 25.5125 7.9764 2.3547
temp: 298.150 k
press: 1.00000 atm
elementType: 53 17 17 17 17 8 6 6 6 6 6 6 6 6 6 1 1 1
symmnumber: 1
zpe: 237685.7 jmol-1
zpe.correction: 0.090530 hartree
zpe.thermalcorrener: 0.106540 hartree
zpe.thermalcorrenthalpy: 0.107485 hartree
zpe.thermalcorrgfe: 0.041342 hartree
zpe.sumelectzpe: -2270.545163 hartree
zpe.sumelectthermal: -2270.529152 hartree
zpe.sumelectthermalent: -2270.528208 hartree
zpe.sumelectthermalfe: -2270.594351 hartree
dipole: 1.1371 0.8967 1.7767
dipole: 2.2921
quadrupole: -117.5113 -126.7629 -127.1481
quadrupole: -6.0009 -0.5744 0.6469
quadrupole: 6.2962 -2.9555 -3.3407 -6.0009 -0.5744 0.6469
hfenergy: -2270.6356925 hartree
pointgroup: C01 [X(C9H3Cl4I1O1)]
dipole: 0.4697004 -0.3455766 -0.6878826 debye
dipolederiv: -0.120508 -0.0241386 -0.0523478 -0.0299463 0.1990603 -0.0048514 -0.0811461 -0.0056448 0.1843775 -0.1829058 -0.2506319 -0.0212046 -0.2342366 -0.5105815 -0.0475433 0.012169 -0.0263116 -0.0032791 -0.2803916 0.2837399 -0.024488 0.2728672 -0.564852 0.0391622 0.0100142 0.0207817 -0.0264645 -0.2765867 0.2961195 -0.0128685 0.3814521 -0.4431227 0.0183252 -0.0224195 0.0232736 0.0107454 -0.7905424 -0.0827082 -0.0570366 -0.1028253 -0.0749676 -0.0085135 -0.0736417 -0.0088481 -0.0213519 -1.8125447 -0.0488687 0.1199823 -0.1064678 -0.3155095 0.0106202 0.3215926 0.0184192 -0.2756283 1.2275699 0.0823054 -0.0496145 0.0473783 -0.195311 -0.0080993 0.2862703 0.0178413 0.0292371 0.0514542 0.363802 0.0483524 0.5142642 0.6362496 0.074776 0.0012807 0.0339701 -0.0360452 0.2609471 -0.4085704 0.0676346 -0.4444249 0.8365871 -0.0480631 0.0164319 -0.0290366 -0.078724 0.0779754 -0.5513883 0.0050278 -0.6706695 0.518717 -0.043686 0.0003491 -0.0410495 -0.0318635 -0.3814113 0.0447058 -0.0208951 0.1041951 -0.2059858 0.0137579 -0.0293181 -0.0010499 -0.0441957 1.085764 0.2504328 0.0948724 0.1904616 0.0220517 0.014653 0.1106595 0.0232837 -0.0392749 1.5974765 0.069914 -0.0850172 0.1194921 0.3429709 -0.0067432 -0.7011872 -0.0263541 0.4641027 -0.8586949 -0.0636132 -0.0774361 -0.0807481 0.0048421 -0.0075431 -0.204627 -0.0186591 -0.0947 0.519269 0.0673558 0.1571987 0.074154 -0.2744148 0.0144434 0.2133309 0.0168699 -0.2213052 0.0726957 -0.0152783 -0.0072685 -0.0174549 0.0467837 -0.0032298 -0.0110006 -0.0025502 0.1709803 -0.0890635 -0.0588764 -0.0323413 -0.0302422 -0.0182534 -0.1158553 0.0817023 -0.0405782 0.005251 -0.1005032 0.0456988 -0.05255 0.0127509 -0.0042642 0.10839 0.0695399 0.0456426 0.008138 unknown
polarizability: 282.5675437|-1.7629368|154.4099262|20.1555785|1.4360866|63.1032036 unknown
InChI: InChI=1S/C9H3Cl4IO/c10-5-4-6(11)9(8(13)7(5)12)15-3-1-2-14/h4H,3H2
charge 0 multiplicity 1
18 atoms
I  6.576396 0.363726 0.308288
Cl -0.173272 2.557399 0.247689
Cl 0.158676 -2.975496 0.208136
Cl -3.402342 2.367375 -0.057726
Cl -4.796418 -0.570599 -0.22218
O  1.187355 -0.118707 0.4474
C  -0.188527 -0.210965 0.21549
C  -0.99569 0.957096 0.146352
C  -0.836791 -1.467946 0.131359
C  -2.401779 0.874675 0.01507
C  -2.231861 -1.576872 0.001829
C  -3.005974 -0.402008 -0.055896
C  2.018142 -0.040865 -0.810666
C  3.422614 0.08166 -0.43553
C  4.619555 0.186281 -0.15569
H  -2.712969 -2.556059 -0.05278
H  1.843414 -0.962373 -1.4005
H  1.685671 0.840377 -1.394342
