program: Gaussian 09
title: 000264771
version: EM64L-G09RevD.01
frameworkgroup: C1[X(C15H16ClN5O2)]
method: RPBEPBE
basis: SDD
operation: Freq
keyword: #p
keyword: freq=noraman
keyword: PBEPBE/SDD
title: #p freq=noraman PBEPBE/SDD
converged: YES YES NO NO
title: Mulliken charges:
elementType: Cl O O N N N N N C C C C C C C C C C C C C C C H H H H H H H H H H H H H H H H
charge: 0.019165 -0.457731 -0.441498 -0.163442 -0.260161 -0.021341 -0.012909 0.061576 0.446610 -0.447567 -0.428194 0.465464 -0.370110 -0.356107 -0.413036 -0.381110 -0.301452 -0.316806 0.101995 0.128151 -0.226385 -0.308824 -0.361044 0.211036 0.269245 0.211878 0.281260 0.230751 0.236427 0.239758 0.278856 0.221230 0.200097 0.209606 0.222925 0.274404 0.353469 0.348243 0.255572
chargesum: 0.00000
title: Mulliken charges with hydrogens summed into heavy atoms:
elementType: Cl O O N N N N N C C C C C C C C C C C C C C C
charge: 0.019165 -0.104262 -0.093255 -0.163442 -0.260161 -0.021341 -0.012909 0.061576 0.446610 0.032714 0.064945 0.465464 -0.139359 -0.119680 -0.173279 -0.102254 0.119874 0.115725 0.101995 0.128151 0.048019 -0.308824 -0.105472
polarizability: 3.82392112e+02 -3.23829699e-01 2.06570905e+02 9.03369754e-01 -2.02044203e+01 1.19919205e+02
1716.lowfreq: -0.0019 -0.0018 -0.0017 2.2152 4.0472 9.6195 21.7294 27.3049 43.3873
frequency: 20.3926 27.1170 43.3578 49.3902 64.8758 84.6150 88.7170 99.8215 115.1603 124.8919 166.9265 171.0412 204.9909 226.9964 229.1427 253.9273 262.8657 294.1552 318.7033 363.6444 367.9714 379.2714 401.7930 412.9889 425.8359 458.3240 490.9571 509.2458 544.4075 552.5866 555.0970 578.6888 621.2124 624.0327 634.5670 647.6006 667.4313 718.2295 729.8439 786.1140 793.8892 800.2140 812.6666 836.2620 838.5427 848.9538 888.4595 892.3485 906.5721 913.4591 930.0920 946.7830 971.8320 976.2961 1009.8857 1023.1377 1028.6293 1055.8531 1090.7684 1109.5427 1128.9533 1153.4880 1165.4709 1171.8972 1175.8495 1207.6431 1212.0111 1217.2219 1234.3912 1252.5188 1273.2643 1284.3761 1302.1846 1309.0974 1328.4320 1332.4875 1347.4942 1358.5283 1361.0048 1372.5934 1379.0128 1391.8076 1396.2207 1398.9300 1444.2932 1447.9400 1466.0768 1471.7628 1472.7762 1493.9746 1499.1125 1526.1166 1555.5547 1571.4113 1635.1032 2944.7880 2974.5193 2993.5299 3002.9536 3013.8161 3071.3251 3076.2295 3095.7071 3137.1157 3166.6086 3169.0983 3184.4987 3186.2406 3241.7174 3551.2087 3580.7199
redmass: 5.8418 8.9009 8.1747 5.6055 6.6483 4.8935 4.0011 3.5882 5.5114 3.2855 8.3300 6.6557 5.5888 3.7211 3.1405 1.4345 4.6291 3.9468 3.6247 1.4063 4.7590 10.6533 3.7741 3.0384 3.1300 2.6965 2.3748 2.5842 4.7377 6.0841 3.2031 2.7666 6.6487 6.5451 5.8421 5.3993 7.4086 3.6230 4.9666 6.5025 1.3347 10.7149 1.6985 2.1773 1.9132 2.4393 7.7860 2.1298 2.3018 1.4321 1.3548 1.3514 3.7966 3.3992 3.0621 2.9536 3.1704 1.8023 1.9130 5.3586 2.4248 2.6190 2.0176 2.3358 1.4038 1.1548 1.4075 1.2025 2.4646 1.4243 3.0766 1.2804 3.6976 4.7848 1.2067 1.3585 1.4341 1.3697 3.7468 1.2556 4.7097 2.0519 1.4150 1.7999 3.1253 4.6485 1.0861 1.1297 1.1104 5.8216 1.2716 2.6266 9.9015 7.6220 6.1926 1.0577 1.0659 1.0688 1.0763 1.0907 1.0998 1.0972 1.0958 1.0888 1.0879 1.0933 1.0928 1.0960 1.0982 1.0657 1.0667
irintensity: 0.2252 0.3957 1.2271 0.8062 1.5223 5.6015 0.9462 2.6010 7.5218 15.9699 2.3760 1.0983 2.6975 23.7354 29.5348 103.1088 9.7248 14.2825 38.5332 121.8685 0.1246 11.9613 3.1916 5.0900 10.8644 17.2411 4.6283 20.2972 6.6762 24.3769 13.1318 7.0741 2.1639 7.0628 6.7816 4.0937 5.6323 0.1429 12.2875 4.0986 9.7396 40.9263 79.4435 4.8791 5.6800 24.9393 122.8943 5.7281 16.3971 13.0249 1.5581 2.1698 13.2017 106.0605 27.6985 25.8517 70.2583 5.6964 5.7760 16.9414 28.7294 2.3717 43.1721 134.4710 54.3772 14.2573 72.4254 8.6832 108.9867 12.5505 2.1437 29.6315 37.5103 198.2443 22.7546 3.3482 53.5289 44.0256 11.4117 65.2334 18.3475 59.3587 3.5334 50.8319 4.6613 60.8737 6.7091 27.7969 3.8942 191.9941 2.3033 398.0472 84.9021 8.2317 186.6646 54.5955 40.0081 41.7890 6.0728 100.3685 17.8568 29.0217 21.0282 14.7275 10.5374 15.3871 8.9342 5.3247 0.6952 3.9896 5.4758
temp: 298.150 k
press: 1.00000 atm
elementType: 17 8 8 7 7 7 7 7 6 6 6 6 6 6 6 6 6 6 6 6 6 6 6 1 1 1 1 1 1 1 1 1 1 1 1 1 1 1 1
symmnumber: 1
zpe: 781880.4 jmol-1
zpe.correction: 0.297803 hartree
zpe.thermalcorrener: 0.318852 hartree
zpe.thermalcorrenthalpy: 0.319796 hartree
zpe.thermalcorrgfe: 0.245583 hartree
zpe.sumelectzpe: -1463.751932 hartree
zpe.sumelectthermal: -1463.730882 hartree
zpe.sumelectthermalent: -1463.729938 hartree
zpe.sumelectthermalfe: -1463.804152 hartree
dipole: 7.2595 -3.3085 -0.7757
dipole: 8.0155
quadrupole: -179.8351 -134.9262 -137.1828
quadrupole: -22.0849 -5.2868 -5.8637
quadrupole: -29.1870 15.7218 13.4652 -22.0849 -5.2868 -5.8637
hfenergy: -1464.0497341 hartree
pointgroup: C01 [X(C15H16Cl1N5O2)]
dipole: -2.8764012 -1.2502078 0.3288244 debye
polarizability: 382.3498922|-2.6672824|206.6069569|-0.9156892|20.227278|119.9253735 unknown
InChI: InChI=1S/C15H16ClN5O2/c16-14-13-15(18-9-17-14)21(10-19-13)12-3-1-11(2-4-12)20(5-7-22)6-8-23/h1-4,9-10,22-23H,5-8H2
charge 0 multiplicity 1
39 atoms
Cl 6.96341 -0.59816 -0.066602
O  -5.758064 -1.61468 1.334612
O  -5.083784 2.512004 -1.219954
N  -3.746298 0.123751 -0.057513
N  1.903721 -0.741267 -0.057452
N  3.884717 -1.933735 -0.144928
N  2.857741 1.555847 0.112992
N  5.303935 1.545755 0.095962
C  -2.359623 -0.091306 -0.055873
C  -4.664735 -0.854981 -0.670155
C  -4.358642 1.194594 0.764472
C  0.48392 -0.508239 -0.065466
C  -1.766648 -1.197646 -0.747636
C  -1.465651 0.799633 0.622543
C  -0.374909 -1.389675 -0.762627
C  -0.077597 0.591928 0.624812
C  -4.948037 -2.090383 0.201658
C  -4.352871 2.565846 0.053827
C  2.938588 0.203197 0.012272
C  4.159909 -0.562389 -0.049964
C  2.542586 -1.996079 -0.141689
C  5.342169 0.207529 -0.000604
C  4.076022 2.163031 0.14747
H  -4.276008 -1.183424 -1.652383
H  -5.62769 -0.349978 -0.861238
H  -3.856078 1.268303 1.749056
H  -5.399775 0.897546 0.966576
H  -2.38694 -1.911655 -1.295186
H  -1.852599 1.668802 1.159207
H  0.037352 -2.225819 -1.338409
H  0.575338 1.29858 1.142978
H  -3.998946 -2.545769 0.550834
H  -5.509662 -2.838232 -0.39929
H  -3.318832 2.93409 -0.107048
H  -4.898399 3.302667 0.667255
H  1.973157 -2.921973 -0.169477
H  -5.883396 -2.34321 1.991739
H  -4.584373 1.911166 -1.830546
H  4.08689 3.252726 0.225374
