program: Gaussian 09
title: 000264781
version: EM64L-G09RevD.01
frameworkgroup: C1[X(C15H17N5O3)]
method: RPBEPBE
basis: SDD
operation: Freq
keyword: #p
keyword: freq=noraman
keyword: PBEPBE/SDD
title: #p freq=noraman PBEPBE/SDD
converged: YES YES NO NO
title: Mulliken charges:
elementType: O O O N N N N N C C C C C C C C C C C C C C C H H H H H H H H H H H H H H H H H
charge: -0.460649 -0.460871 -0.204242 -0.134169 -0.272448 -0.353179 -0.028708 -0.007845 0.449806 -0.441874 -0.441613 0.415946 -0.355949 -0.353521 0.275810 -0.441131 -0.400288 -0.298640 -0.299249 -0.107124 -0.246011 0.031401 -0.241964 0.209435 0.299429 0.212006 0.299537 0.234081 0.233552 0.260265 0.253316 0.213164 0.199477 0.212096 0.199990 0.274958 0.333489 0.236395 0.352968 0.352357
chargesum: 0.00000
title: Mulliken charges with hydrogens summed into heavy atoms:
elementType: O O O N N N N N C C C C C C C C C C C C C C C
charge: -0.107682 -0.108515 -0.204242 -0.134169 -0.272448 -0.019690 -0.028708 -0.007845 0.449806 0.066990 0.069930 0.415946 -0.121868 -0.119970 0.275810 -0.180866 -0.146972 0.114001 0.112837 -0.107124 0.028947 0.031401 -0.005568
polarizability: 3.46205192e+02 1.40412272e+00 1.50418259e+02 -5.93941719e+00 1.93925604e+01 1.72610959e+02
1716.lowfreq: -9.1572 -0.0008 0.0000 0.0004 3.1646 5.1688 17.4461 27.3374 40.5116
frequency: 17.0674 27.3284 40.5055 49.8686 56.0439 85.4828 90.8299 106.4965 108.9749 124.4734 149.1344 179.0930 189.4279 241.7874 251.8867 262.6882 269.2453 288.0032 293.1546 342.8052 386.7117 399.3285 413.4267 422.9208 454.8702 484.7697 487.8652 496.0028 512.3365 547.0799 571.5388 571.9728 586.4909 619.2181 622.5183 650.1948 659.6969 685.3010 721.7457 730.8327 765.7631 790.7405 800.0807 811.4965 837.6336 847.0261 860.8461 885.5878 902.0668 907.0601 924.9238 937.0543 947.7589 953.1575 992.2115 996.5549 1028.1903 1034.2025 1057.2306 1060.4094 1089.9625 1103.8741 1127.6251 1152.8047 1158.5716 1197.8566 1199.2458 1208.3243 1212.9213 1225.2661 1232.9594 1265.3142 1275.3094 1287.6386 1314.7443 1323.3563 1352.1896 1354.1150 1362.3923 1365.6756 1369.1922 1395.1458 1400.9865 1404.2321 1418.7902 1441.8143 1470.9186 1473.8463 1477.8810 1498.6617 1509.0670 1527.8112 1534.0128 1558.3159 1595.6082 1633.1955 1634.8171 2943.0657 2943.5610 3000.7564 3002.6265 3017.2563 3019.5422 3084.8861 3090.7230 3119.3488 3130.9684 3142.3155 3170.2419 3174.9030 3239.6371 3525.7798 3579.8283 3580.1743
redmass: 5.8341 6.4206 7.8713 5.0054 6.2520 4.4089 5.1318 3.8293 4.9134 4.0258 3.5187 6.1538 5.1542 2.4951 1.5092 1.5646 3.4169 2.6569 4.8817 4.9327 4.1925 3.8368 3.9772 3.0615 2.4654 5.1791 3.5111 3.5875 2.5561 2.8596 2.1974 1.4513 4.4207 6.0536 5.0079 4.7262 10.9400 6.0429 3.9074 4.9549 2.4768 2.5773 1.2664 1.8498 2.9754 2.4007 7.6655 1.4597 2.2626 2.5205 7.9144 1.3541 1.6901 3.3609 2.2838 2.9965 3.5496 2.9597 2.9008 1.7695 2.0276 2.7834 1.7536 2.5185 1.6908 1.1959 1.1212 1.0915 1.2246 1.6915 1.7198 4.2487 1.3110 1.2266 1.6088 2.0866 1.3215 1.6027 2.4619 1.3835 4.3618 1.4148 1.4162 2.5468 3.7831 3.5622 1.0805 1.0812 1.1330 1.2343 4.6362 3.1433 4.9011 6.8790 7.0012 6.4046 12.1148 1.0563 1.0563 1.0999 1.0999 1.0715 1.0695 1.0992 1.0986 1.0924 1.0899 1.0895 1.0930 1.0941 1.0987 1.0792 1.0666 1.0667
irintensity: 0.2940 3.1695 7.2262 0.5844 0.6889 1.6421 1.4183 18.7530 5.6312 8.8782 4.6226 3.5235 2.5473 40.9382 125.3992 56.5301 38.0996 84.4943 3.2105 1.1965 0.1803 4.7136 0.8649 1.6687 15.9183 7.7545 2.5692 8.2035 30.1719 16.5129 43.1972 57.3285 3.5940 1.7489 0.8289 6.3406 3.8584 27.7781 3.7299 18.1416 22.4230 6.2248 1.6191 61.4994 1.3664 38.9016 9.4123 11.6296 0.8958 38.7774 39.9145 2.2466 6.5147 14.8190 16.5746 2.1788 57.8436 67.1333 17.9783 0.6699 6.3118 56.6292 2.4869 61.1702 63.2681 137.2644 2.4383 5.4198 11.7498 13.7967 29.4689 1.5957 21.7996 15.4673 14.8804 61.7144 3.4974 20.0639 12.9275 99.9351 2.5549 2.8996 3.1958 63.0800 11.9003 5.8922 10.1141 17.6439 20.7119 21.9553 32.8718 35.7816 751.2741 14.4359 43.8902 300.4777 343.9352 108.7868 0.9098 24.6759 69.2739 89.5016 32.8185 1.9355 9.5104 20.2514 11.5137 11.7004 17.3300 10.4956 0.3553 47.5744 4.9914 3.8739
temp: 298.150 k
press: 1.00000 atm
elementType: 8 8 8 7 7 7 7 7 6 6 6 6 6 6 6 6 6 6 6 6 6 6 6 1 1 1 1 1 1 1 1 1 1 1 1 1 1 1 1 1
symmnumber: 1
zpe: 816207.1 jmol-1
zpe.correction: 0.310877 hartree
zpe.thermalcorrener: 0.332061 hartree
zpe.thermalcorrenthalpy: 0.333005 hartree
zpe.thermalcorrgfe: 0.258561 hartree
zpe.sumelectzpe: -1079.503176 hartree
zpe.sumelectthermal: -1079.481992 hartree
zpe.sumelectthermalent: -1079.481048 hartree
zpe.sumelectthermalfe: -1079.555492 hartree
dipole: -15.5789 0.3433 2.6495
dipole: 15.8063
quadrupole: -222.3606 -113.1842 -127.0982
quadrupole: 1.9650 10.3985 -1.9174
quadrupole: -68.1463 41.0302 27.1161 1.9650 10.3985 -1.9174
hfenergy: -1079.8140531 hartree
pointgroup: C01 [X(C15H17N5O3)]
dipole: -6.1216279 0.7114486 -0.8316315 debye
polarizability: 345.7390718|-11.6160113|140.213921|1.4289101|-4.6581012|183.2814176 unknown
InChI: InChI=1S/C15H17N5O3/c21-7-5-19(6-8-22)11-1-3-12(4-2-11)20-10-18-13-14(20)16-9-17-15(13)23/h1-4,9-10,16,21-22H,5-8H2
charge 0 multiplicity 1
40 atoms
O  -5.818151 -1.878801 -0.083902
O  -5.387924 2.591863 -0.214778
O  6.623162 -0.306533 0.177864
N  -3.675661 0.177262 0.074101
N  1.963425 -0.382612 0.769791
N  2.857122 0.610592 -1.349014
N  3.976756 -0.926359 1.731596
N  5.267645 0.595328 -1.534699
C  -2.298116 0.044303 0.240698
C  -4.358115 -0.286416 -1.148173
C  -4.528949 0.777347 1.116896
C  0.543424 -0.232776 0.589466
C  -1.486202 -0.646164 -0.722538
C  -1.622366 0.58814 1.386229
C  2.96565 -0.008736 -0.117037
C  -0.099476 -0.785472 -0.54494
C  -0.234214 0.454792 1.550593
C  -4.768038 -1.767244 -1.110264
C  -4.644279 2.306742 1.024353
C  4.204333 -0.34032 0.469143
C  2.647774 -0.937899 1.883809
C  5.464101 -0.052394 -0.235205
C  4.0743 0.883365 -1.999393
H  -3.721517 -0.102818 -2.033423
H  -5.263566 0.328565 -1.280185
H  -4.158409 0.496546 2.119982
H  -5.535823 0.338778 1.020079
H  -1.942264 -1.107846 -1.601645
H  -2.180498 1.138411 2.147628
H  0.48122 -1.366123 -1.271642
H  0.255778 0.901207 2.422977
H  -3.898836 -2.410384 -0.860863
H  -5.159567 -2.059122 -2.108996
H  -3.639222 2.776827 1.000592
H  -5.197958 2.680927 1.912745
H  2.10258 -1.340441 2.73407
H  1.955362 0.877703 -1.750659
H  3.971031 1.376577 -2.97434
H  -6.06337 -2.827966 0.047364
H  -5.44434 3.569051 -0.35728
