program: Gaussian 09
title: 000264741
version: EM64L-G09RevD.01
frameworkgroup: C1[X(C8H8ClN5O2)]
method: RPBEPBE
basis: SDD
operation: Freq
keyword: #p
keyword: freq=noraman
keyword: PBEPBE/SDD
title: #p freq=noraman PBEPBE/SDD
converged: NO NO NO NO
title: Mulliken charges:
elementType: Cl O O N N N N N C C C C C C C C H H H H H H H H
charge: 0.032079 -0.323000 -0.201764 -0.437852 0.096132 -0.047958 0.005447 -0.346283 0.197276 0.125522 0.227306 -0.414190 -0.391506 -0.215383 0.265578 -0.672670 0.254132 0.343081 0.231545 0.231527 0.368281 0.214932 0.228883 0.228885
chargesum: 0.00000
title: Mulliken charges with hydrogens summed into heavy atoms:
elementType: Cl O O N N N N N C C C C C C C C
charge: 0.032079 -0.323000 -0.201764 -0.094771 0.096132 -0.047958 0.005447 0.021998 0.197276 0.125522 0.227306 -0.160057 -0.391506 0.247688 0.265578 0.000029
polarizability: 2.30674920e+02 -7.85767871e+00 1.57246985e+02 7.19955496e-03 1.47598139e-02 6.34980073e+01
1716.lowfreq: -5.8045 -4.3907 -1.8410 0.0013 0.0025 0.0026 28.9945 37.6171 66.3104
frequency: 26.1611 37.6125 66.1912 66.4093 109.6548 133.8709 153.1863 186.9970 208.7353 247.4958 251.7883 256.2826 303.2958 355.3281 369.4376 393.4505 469.7523 575.8818 578.1337 622.7457 625.0131 643.2732 678.5459 712.2062 734.0175 734.6543 777.6851 802.7767 804.9266 846.4666 847.0048 894.3427 923.1203 940.1749 990.3614 1043.0664 1078.3836 1107.1824 1116.6125 1126.6372 1141.3234 1188.3863 1220.4090 1252.0197 1309.8190 1345.5157 1362.5904 1401.7583 1415.4325 1433.8900 1444.6609 1463.9644 1476.5341 1489.1744 1496.7509 1555.4599 1610.6767 1693.2742 2995.3847 3009.2579 3067.4812 3093.2909 3105.5951 3172.6736 3545.5476 3606.7218
redmass: 7.7113 4.8178 2.4611 5.7432 3.7844 5.2813 6.2129 5.5102 9.4188 5.2248 1.3362 7.7662 8.1530 5.2185 3.9095 11.4147 7.3272 9.0606 7.2420 8.6983 7.0651 1.5815 7.5495 3.7991 5.9335 1.1241 4.5634 1.0959 6.5017 4.5800 1.7562 6.9329 12.2309 8.2338 3.3156 3.4415 5.8813 2.6454 5.6157 3.1585 1.4682 1.9376 5.0787 1.1269 4.4750 4.9974 1.5285 1.2653 1.9139 1.8448 4.8548 1.0402 1.0608 1.1827 4.4838 3.1586 9.5283 8.7506 1.0356 1.0582 1.1068 1.0986 1.1028 1.0940 1.0760 1.0836
irintensity: 1.2969 0.3792 1.6750 0.6997 1.6228 0.7944 2.0787 6.1435 2.2175 1.1646 2.3592 0.3707 18.5176 0.5388 4.9513 4.6199 8.9887 13.5388 1.2310 2.1853 1.2617 34.9564 0.2275 67.0711 27.9287 96.2318 13.9254 4.0322 0.5979 30.5999 64.4566 59.5011 0.5879 72.6610 120.2590 308.9690 72.7779 155.5071 18.2378 344.7799 5.0077 23.9602 52.8644 0.0060 6.6050 177.5896 10.6404 25.4416 91.4341 14.5607 109.2833 12.1694 20.9833 69.6055 341.9139 413.7919 351.5233 250.1843 23.0044 22.5615 7.3342 30.8672 46.8753 6.7364 44.7987 184.2937
temp: 298.150 k
press: 1.00000 atm
elementType: 17 8 8 7 7 7 7 7 6 6 6 6 6 6 6 6 1 1 1 1 1 1 1 1
symmnumber: 1
zpe: 441041.9 jmol-1
zpe.correction: 0.167984 hartree
zpe.thermalcorrener: 0.182497 hartree
zpe.thermalcorrenthalpy: 0.183441 hartree
zpe.thermalcorrgfe: 0.124102 hartree
zpe.sumelectzpe: -1192.727679 hartree
zpe.sumelectthermal: -1192.713166 hartree
zpe.sumelectthermalent: -1192.712222 hartree
zpe.sumelectthermalfe: -1192.771561 hartree
dipole: -0.8977 -4.8773 -0.0003
dipole: 4.9592
quadrupole: -69.8262 -104.8628 -98.8019
quadrupole: -4.0988 -0.0008 0.0004
quadrupole: 21.3374 -13.6992 -7.6383 -4.0988 -0.0008 0.0004
hfenergy: -1192.8956631 hartree
pointgroup: C01 [X(C8H8Cl1N5O2)]
dipole: -0.2410188 1.93616 0.0001206 debye
dipolederiv: -0.1726797 0.206122 0.000048 0.3050912 -0.884429 -0.0001825 0.0000722 -0.0001694 -0.054779 -2.2204006 0.1722286 -0.0001832 0.4722321 -0.5493803 0.0000157 -0.0006044 0.0000668 -0.316959 -0.772804 -0.0438386 -0.0000277 -0.2617044 -0.9112341 0.0001818 -0.0001631 -0.0001545 -0.3002334 -2.6051541 -0.2953419 -0.0000048 -0.4909958 -0.3914865 -0.0000077 0.0001655 0.0000083 -0.3522984 -1.0873393 0.468574 0.0001664 0.4947289 -0.4330634 -0.0000976 0.0001978 -0.0001033 -0.1468688 -0.1599659 0.3159794 0.0000612 -0.3058457 -0.3387793 -0.0000037 -0.0001033 -0.0000857 -0.147463 -0.0516849 0.1187943 0.0000184 0.3038032 -0.2250356 -0.0000629 0.0000452 -0.0000402 -0.0987662 -0.5642387 -0.429446 -0.0000605 -0.1908786 0.3438458 0.0001299 0.0000515 0.0001717 -0.188282 0.6751502 -0.164192 -0.0000712 -0.0970482 -0.0329637 -0.0000215 -0.0000739 -0.0000128 0.0732086 -0.2133833 -0.126005 0.0000046 0.1478796 -0.4834333 -0.0001209 0.0000389 -0.000104 0.0867051 2.3265006 -0.1227739 -0.0002085 -0.4351823 0.2459545 0.0000657 -0.0003048 0.000051 0.1482401 -0.7584875 0.063917 0.0000406 -0.2935587 -0.0761288 0.0000601 0.0000779 0.0000483 -0.2033614 0.9192089 -0.3452244 -0.0001427 -0.3900736 1.6126786 0.0003269 -0.0001816 0.0003296 0.0343642 1.1723548 0.0112142 0.000104 0.2776605 0.2459613 0.0000257 0.0002222 -0.0000225 0.3532379 3.0332738 0.0912578 0.000164 0.496461 1.4575689 -0.0002288 0.0005224 0.0000862 0.3170851 -0.1336096 0.0797208 -0.0000584 0.0408012 0.0091755 0.0000498 -0.0000672 0.0000488 0.0669827 0.0533226 0.0447181 0.0000235 0.0972584 -0.0125611 -0.0000517 0.0000324 -0.0000481 0.1940673 0.2152979 -0.0512046 0.0000255 -0.0593645 0.1511796 -0.000004 -0.0000138 -0.0000176 0.3283986 -0.0637303 0.0232457 0.0242226 -0.0799983 -0.0021687 -0.0890531 -0.0147192 -0.1019684 -0.0600567 -0.063771 0.023157 -0.024187 -0.0800718 -0.0021213 0.0890306 0.014769 0.1019971 -0.0601692 0.3851726 0.0625679 0.0000094 0.0551349 0.2336549 -0.0000273 -0.0000036 -0.0000313 0.3405805 -0.1506832 -0.0734857 -0.0000569 -0.1002658 0.0325589 -0.0000198 -0.0000697 -0.0000102 0.1165242 0.1188307 -0.0149586 -0.029759 0.0470075 0.0050604 -0.1061891 0.0020747 -0.1173641 -0.0650461 0.1188202 -0.0150262 0.0298715 0.046929 0.0051466 0.1061844 -0.0019651 0.1173241 -0.0651112 unknown
polarizability: 231.3388388|3.5428981|156.5830659|-0.0063293|0.0151534|63.4980073 unknown
InChI: InChI=1S/C8H8ClN5O2/c1-2-16-8(15)11-5-3-4-6(7(9)10-5)13-14-12-4/h3,11,14H,2H2,1H3
charge 0 multiplicity 1
24 atoms
Cl 2.081515 -3.034114 -0.000605
O  -3.676492 0.545515 0.000213
O  -2.522937 -1.512556 0.000271
N  -1.435736 0.626168 0.000509
N  0.341244 -0.963632 -0.000024
N  3.354992 1.906674 0.000246
N  4.024626 -0.361857 -0.000289
N  4.359088 0.961978 -0.000078
C  2.225467 1.100876 0.000177
C  2.642841 -0.287578 -0.000132
C  -0.055285 0.361427 0.000271
C  0.849827 1.443327 0.00038
C  1.621932 -1.279143 -0.000229
C  -4.961808 -0.210396 -0.000105
C  -2.51683 -0.26733 0.000533
C  -6.08079 0.825755 -0.000685
H  0.5159 2.483867 0.00063
H  -1.718021 1.609029 0.000631
H  -4.984379 -0.858336 -0.89515
H  -4.985003 -0.858001 0.895169
H  5.337388 1.249626 -0.000131
H  -7.05878 0.311292 -0.000915
H  -6.026685 1.468081 0.895264
H  -6.026074 1.467727 -0.896849
