program: Gaussian 09
title: 000264736
version: EM64L-G09RevD.01
frameworkgroup: C1[X(C12H11NO2)]
method: RPBEPBE
basis: SDD
operation: Freq
keyword: #p
keyword: freq=noraman
keyword: PBEPBE/SDD
title: #p freq=noraman PBEPBE/SDD
converged: YES YES NO NO
title: Mulliken charges:
elementType: O O N C C C C C C C C C C C C H H H H H H H H H H H
charge: -0.411937 -0.232390 -0.021603 0.444163 -0.577181 0.234984 -0.495395 -0.064497 -0.358207 -0.384657 -0.308874 -0.374698 -0.264779 -0.224104 0.191596 0.248573 0.236173 0.269872 0.276762 0.233360 0.239520 0.262557 0.238475 0.229984 0.233373 0.378932
chargesum: 0.00000
title: Mulliken charges with hydrogens summed into heavy atoms:
elementType: O O N C C C C C C C C C C C C
charge: -0.033005 -0.232390 -0.021603 0.444163 -0.092436 0.234984 0.051239 -0.064497 -0.124847 -0.145137 -0.046317 -0.136224 -0.034795 0.009269 0.191596
polarizability: 1.70307013e+02 8.54137179e+00 1.69606448e+02 -1.37372529e+01 2.75216228e+00 8.20442908e+01
1716.lowfreq: -0.0006 -0.0003 0.0002 1.4485 5.5031 7.3425 12.8162 35.9675 62.6257
frequency: 11.0322 35.8202 62.6232 105.2160 148.8437 175.7173 187.5644 263.6533 289.6481 403.2974 438.9213 446.5012 470.6010 497.1363 507.9177 514.3019 553.1610 586.2764 611.5000 644.4533 656.5799 703.8456 771.9537 786.6061 800.0312 809.1420 842.9799 854.3191 879.8394 898.1646 961.9198 969.5437 982.7760 998.4184 1020.3569 1022.3065 1056.5454 1076.7646 1080.0069 1142.9569 1155.9273 1176.4146 1219.3963 1243.1100 1249.1185 1262.4980 1275.4469 1306.4767 1343.8916 1368.3496 1380.0945 1388.6056 1431.1331 1444.9116 1453.1397 1487.8708 1511.7187 1553.7443 1587.6749 1621.4873 1665.0320 3001.6008 3016.2822 3054.3671 3078.4624 3118.9960 3127.9344 3140.8064 3145.7537 3156.6594 3172.4790 3510.5717
redmass: 11.1784 5.4169 5.3304 2.3405 4.2400 4.3163 7.1855 4.5418 3.1761 4.3632 3.3189 3.2376 3.1437 6.0016 2.3483 4.0015 6.0688 3.8480 4.3707 1.3885 3.4449 4.4257 1.3582 1.5462 3.0070 4.6558 5.5096 1.4129 1.7715 2.9604 1.4444 1.3864 2.4025 1.3277 2.8482 2.9973 2.2892 2.2785 2.7566 1.3912 1.2422 1.1742 2.0221 1.4216 1.7156 1.5439 1.3428 1.9139 2.9815 1.7819 2.1855 2.6707 2.6636 1.0981 2.7325 1.1356 3.4706 6.8060 6.7204 6.3633 8.2758 1.0632 1.0602 1.0974 1.1017 1.0883 1.0854 1.0898 1.0960 1.0955 1.0994 1.0640
irintensity: 1.5717 0.1604 0.8546 0.3193 0.9600 5.9379 2.5052 0.3746 0.5161 3.4601 10.4450 18.9111 0.1718 20.2836 19.5254 8.0239 25.3623 2.5873 1.3598 122.0799 3.6088 4.2051 71.7257 11.3101 3.6019 1.5970 4.5360 35.7072 0.4377 4.1420 0.1850 4.1629 13.4895 0.1024 87.0939 81.6440 20.1118 100.7464 20.8897 5.2874 3.2051 1.2461 1.2742 2.1808 3.0455 10.4760 4.5331 36.3440 20.7126 49.8175 4.0404 6.3506 8.2513 29.0024 2.8636 14.8171 27.1926 13.3312 30.3735 2.9912 218.8213 6.1060 15.8509 0.8016 15.9682 17.1132 0.5068 13.1387 32.8450 21.6448 19.1471 23.1632
temp: 298.150 k
press: 1.00000 atm
elementType: 8 8 7 6 6 6 6 6 6 6 6 6 6 6 6 1 1 1 1 1 1 1 1 1 1 1
symmnumber: 1
zpe: 531854.9 jmol-1
zpe.correction: 0.202573 hartree
zpe.thermalcorrener: 0.215183 hartree
zpe.thermalcorrenthalpy: 0.216127 hartree
zpe.thermalcorrgfe: 0.160900 hartree
zpe.sumelectzpe: -668.030642 hartree
zpe.sumelectthermal: -668.018032 hartree
zpe.sumelectthermalent: -668.017088 hartree
zpe.sumelectthermalfe: -668.072315 hartree
dipole: 1.8851 -0.7606 0.7726
dipole: 2.1746
quadrupole: -87.2676 -76.8688 -94.6890
quadrupole: 6.9166 5.7648 -2.1300
quadrupole: -0.9925 9.4064 -8.4139 6.9166 5.7648 -2.1300
hfenergy: -668.2332151 hartree
pointgroup: C01 [X(C12H11N1O2)]
dipole: 0.7256359 -0.3312605 0.3093498 debye
dipolederiv: -0.8396509 0.0156051 -0.5276219 0.0566234 -0.3980027 0.1253614 -0.5437818 0.0980236 -0.8771765 -0.7278778 0.1390071 0.198527 0.1356521 -0.3518404 -0.1573915 -0.0481759 -0.056013 -0.9175577 -0.4029295 -0.0391834 0.01728 -0.033115 -0.3470924 0.0091821 0.0356268 0.0075432 -0.2543581 0.4732751 0.0079126 -0.0510695 -0.1278287 0.1978761 0.0309419 -0.1021562 0.0145513 -0.0449156 -0.0268058 0.0490646 -0.0049363 0.1112597 0.0851558 -0.0137545 -0.0588794 -0.0031634 0.0665218 -0.3281235 -0.05614 0.0646713 0.0824263 -0.0164362 -0.017343 0.1028985 0.020155 0.0284727 -0.3732843 0.1204458 0.0622928 0.1134046 0.0961575 -0.0162635 0.3093944 -0.0514356 -0.0403651 0.0758254 0.209685 0.0127764 0.0076839 0.2187653 0.0060664 -0.0050258 -0.051212 0.0531416 -0.2158397 0.2295452 -0.0042046 0.2202471 -0.2235416 -0.0397499 0.0207663 -0.0616889 -0.1158136 0.0147622 -0.0577762 -0.0422586 -0.0498468 -0.0328057 0.0097681 -0.0846902 0.0251704 -0.1399002 0.0923961 -0.0517337 -0.0680142 -0.0752834 -0.0754283 0.0223554 -0.0658106 0.0150762 -0.1267953 0.2951227 -0.2042635 -0.088305 -0.0702852 0.3388243 0.026561 -0.0931651 0.0677743 -0.0348886 -0.0406031 -0.1048402 -0.0412271 -0.084108 0.1024312 0.0429851 -0.0356462 0.0476118 -0.1385426 0.0877009 0.1179214 -0.0585849 0.1084727 -0.038006 -0.022918 -0.0583877 -0.0270779 -0.1414996 1.4448288 -0.3119673 0.1863744 -0.3460448 0.2949951 0.1131152 0.272245 0.0748717 1.4635698 0.0870821 -0.0083281 -0.0058444 0.014709 -0.0047535 -0.1035106 -0.0246425 -0.0602714 0.0125743 0.0108144 -0.0446357 0.0308286 -0.0969548 -0.0574467 0.0923926 0.0077735 0.0457476 0.0437835 0.082004 0.01176 -0.028724 -0.0073762 0.0069841 -0.0899451 -0.0518231 -0.0502793 0.0233965 0.0912645 -0.0412771 0.0440638 -0.0193284 -0.0054024 0.0756331 0.0398939 0.046198 0.0636827 -0.014869 -0.1283835 0.0426377 -0.0986886 -0.0022997 0.0125924 0.0424415 0.0250866 0.1340984 -0.0673773 0.0827823 0.0586842 0.0562052 0.0625555 -0.0070178 0.0725297 -0.0259201 0.1212046 -0.0305942 0.0138845 0.0489011 0.0676373 0.0824771 -0.021872 0.0546127 -0.0067857 0.1431416 0.0692789 0.0356095 0.0124463 0.0353636 -0.1449515 -0.0177259 0.0180593 -0.0223617 0.1194113 0.085253 0.0383277 0.0222022 0.022137 -0.1185134 -0.026957 0.0226567 -0.0286581 0.1493377 -0.0277615 -0.1081829 0.041017 -0.115099 -0.0087977 0.0190686 0.0428019 0.0203525 0.1501206 0.1861086 0.0851605 0.0780878 0.092137 0.3390963 -0.0515744 0.1304842 -0.0632951 0.259356 unknown
polarizability: 171.1719364|8.2617327|168.8416904|-13.6484452|2.158017|81.9441242 unknown
InChI: InChI=1S/C12H11NO2/c14-12(15)6-5-9-7-8-13-11-4-2-1-3-10(9)11/h1-4,7-8,14H,5-6H2
charge 0 multiplicity 1
26 atoms
O  4.495147 -0.596989 1.299224
O  4.123346 -0.806332 -0.98347
N  -2.567827 1.687256 0.323813
C  0.107376 0.881625 -0.424191
C  1.535904 0.49624 -0.767566
C  -0.919273 -0.114242 -0.210441
C  2.321879 0.045994 0.490577
C  -2.245197 0.341902 0.16644
C  -0.251303 2.226058 -0.267265
C  -0.699286 -1.524435 -0.357316
C  -3.285399 -0.616212 0.388826
C  -1.586354 2.581301 0.103679
C  -1.733666 -2.437633 -0.136578
C  -3.036089 -1.98233 0.24247
C  3.701093 -0.483388 0.148551
H  1.569756 -0.313331 -1.518251
H  2.055055 1.35868 -1.222169
H  2.42683 0.871851 1.216639
H  1.778357 -0.756368 1.027234
H  0.488415 3.018467 -0.426743
H  0.287352 -1.892558 -0.659416
H  -4.270134 -0.231395 0.671139
H  -1.857666 3.636992 0.225859
H  -1.550275 -3.510904 -0.257958
H  -3.837008 -2.710055 0.412566
H  5.384365 -0.970191 1.049845
