program: Gaussian 09
title: 000264762
version: EM64L-G09RevD.01
frameworkgroup: C1[X(C15H15Cl2N5)]
method: RPBEPBE
basis: SDD
operation: Freq
keyword: #p
keyword: freq=noraman
keyword: PBEPBE/SDD
title: #p freq=noraman PBEPBE/SDD
converged: YES YES NO NO
title: Mulliken charges:
elementType: Cl Cl N N N N N C C C C C C C C C C C C C C C H H H H H H H H H H H H H H H
charge: -0.058720 -0.060801 -0.134805 -0.263461 -0.078240 -0.089838 -0.038589 0.209937 -0.090251 -0.357244 -0.330588 0.105872 0.452785 -0.248886 -0.588140 -0.589419 -0.385267 -0.364105 -0.341392 -0.224180 -0.223454 -0.239990 0.243446 0.285759 0.236719 0.273520 0.275170 0.309805 0.260679 0.307937 0.260078 0.249052 0.238413 0.297117 0.232511 0.233574 0.234999
chargesum: 0.00000
title: Mulliken charges with hydrogens summed into heavy atoms:
elementType: Cl Cl N N N N N C C C C C C C C C C C C C C C
charge: -0.058720 -0.060801 -0.134805 -0.263461 -0.078240 -0.089838 -0.038589 0.209937 -0.090251 0.171961 0.179650 0.105872 0.452785 0.026284 -0.017655 -0.021405 -0.136214 -0.125692 -0.044275 0.008331 0.010121 -0.004991
polarizability: 3.53763723e+02 -2.18706372e+00 2.29504370e+02 2.72374112e+00 -1.10330600e+01 1.05949371e+02
1716.lowfreq: -4.7984 -2.5281 -0.0008 0.0009 0.0010 3.6906 22.4260 29.2444 35.5515
frequency: 22.2774 29.2329 35.5392 38.8533 42.7837 71.7670 91.6828 101.8142 107.8425 145.3384 178.0705 201.8683 218.0317 226.0143 237.5163 253.4947 273.7258 326.7851 348.0011 372.4922 392.4166 404.0804 473.0461 503.8218 534.2901 561.7592 594.2662 613.3055 618.5580 639.8372 664.3817 670.9859 692.8757 699.1410 701.8901 709.1565 767.5058 778.7547 783.5363 787.0432 817.3113 834.6775 838.8186 901.7902 916.3040 931.0066 958.6167 972.4604 988.5653 996.8327 1002.6851 1019.7573 1034.5281 1043.9398 1050.8619 1082.1114 1085.0499 1100.0541 1127.3355 1163.8436 1177.2451 1196.0888 1201.8137 1226.3452 1249.3210 1260.6006 1264.0516 1275.3150 1290.1505 1302.3018 1313.2174 1326.1941 1337.1416 1359.7695 1365.8638 1368.0298 1384.1744 1393.8530 1427.5154 1442.8280 1447.9280 1450.3573 1456.0747 1462.6850 1484.4437 1493.7190 1523.2240 1575.7852 1597.4755 1614.0412 3027.8284 3033.1939 3059.7383 3063.3646 3102.9997 3105.2017 3134.1663 3143.2696 3153.9988 3155.3279 3157.6712 3164.0995 3169.7844 3186.0275 3245.4504
redmass: 4.6515 7.8494 12.1762 10.2444 7.1987 5.8333 2.9524 3.6732 2.4440 6.2392 8.0922 5.7170 6.1246 3.9859 6.3518 4.6161 5.5891 5.3997 4.7983 3.3942 4.9977 2.9238 6.5104 3.5736 4.7055 3.9108 6.7595 6.2612 6.6167 4.7031 7.5276 7.4686 2.2976 6.0552 4.9704 4.4481 1.6996 1.2177 1.3371 3.2102 1.7309 6.4488 1.3170 5.5523 1.4280 1.4278 4.8594 1.3845 4.6846 1.4054 1.5141 2.1611 1.7949 4.0906 4.3157 2.0758 1.7454 4.8733 1.5364 3.4581 1.0774 1.1954 1.7091 2.1719 1.8211 1.1962 1.2980 2.5004 1.8785 1.6476 1.7024 4.8631 1.5016 1.2294 2.5666 1.5258 5.7281 1.8316 2.6583 1.1302 1.8707 1.6973 1.2383 1.3332 1.6298 2.7017 7.7256 6.9670 6.6613 5.9743 1.0616 1.0613 1.0576 1.0579 1.1017 1.1033 1.0853 1.0891 1.1116 1.0944 1.1113 1.0921 1.0994 1.0968 1.0982
irintensity: 0.3215 0.1121 0.3515 0.2244 0.8436 1.4583 2.3661 0.7639 3.2106 1.7495 0.6513 0.4670 3.0281 8.5612 0.8008 3.8123 1.3384 0.8171 8.5579 8.0468 5.9664 1.3939 7.4424 16.3964 4.9704 3.9929 1.3270 1.9571 11.9292 11.6713 4.9874 80.2313 38.2497 11.1239 22.3877 54.8460 72.9663 34.0249 7.5987 12.3563 7.7511 4.9396 3.0159 12.3727 6.2681 12.1910 47.9766 1.9560 0.1255 1.1581 3.0421 6.7567 11.8104 2.2443 2.8145 32.0778 6.4272 8.0751 24.8057 55.4343 2.8580 0.1497 20.3219 25.6433 33.3332 46.5412 19.7791 40.9559 88.5145 19.8130 9.3618 121.0345 24.7091 0.9873 75.8294 5.3003 6.7730 9.7595 90.9252 10.1931 23.9858 17.0146 9.7547 20.5743 4.6694 221.7242 54.5435 835.5169 8.3561 18.5695 10.1226 33.3689 15.2446 18.1000 2.1119 1.0348 2.0641 8.8370 5.8515 26.1958 6.5817 15.1444 16.6682 9.1193 0.6463
temp: 298.150 k
press: 1.00000 atm
elementType: 17 17 7 7 7 7 7 6 6 6 6 6 6 6 6 6 6 6 6 6 6 6 1 1 1 1 1 1 1 1 1 1 1 1 1 1 1
symmnumber: 1
zpe: 741385.7 jmol-1
zpe.correction: 0.282379 hartree
zpe.thermalcorrener: 0.302137 hartree
zpe.thermalcorrenthalpy: 0.303081 hartree
zpe.thermalcorrgfe: 0.230322 hartree
zpe.sumelectzpe: -1772.905221 hartree
zpe.sumelectthermal: -1772.885463 hartree
zpe.sumelectthermalent: -1772.884519 hartree
zpe.sumelectthermalfe: -1772.957278 hartree
dipole: -4.3733 0.6409 -0.3510
dipole: 4.4339
quadrupole: -134.9019 -154.3042 -143.7515
quadrupole: -0.8766 1.3758 3.3341
quadrupole: 9.4173 -9.9850 0.5677 -0.8766 1.3758 3.3341
hfenergy: -1773.1875996 hartree
pointgroup: C01 [X(C15H15Cl2N5)]
dipole: -1.7232502 0.2423634 -0.121108 debye
polarizability: 353.8124374|-1.2529949|230.1291646|1.6289893|-6.3257491|105.2758623 unknown
InChI: InChI=1S/C15H15Cl2N5/c16-6-8-21(9-7-17)14-13-15(19-10-18-14)22(11-20-13)12-4-2-1-3-5-12/h1-5,10-11H,6-9H2
charge 0 multiplicity 1
37 atoms
Cl 3.628018 4.249026 0.156316
Cl 6.228405 -2.361664 -0.37603
N  2.961414 0.161448 0.026473
N  -1.78582 0.384652 -0.156026
N  0.149772 1.607293 -0.379903
N  1.663237 -1.755611 0.470369
N  -0.785716 -1.835246 0.388612
C  1.711389 -0.417382 0.136557
C  0.469533 0.268005 -0.06861
C  3.161684 1.556914 -0.429141
C  4.164661 -0.632518 0.374608
C  -0.720481 -0.509683 0.072777
C  -3.198988 0.11554 -0.114133
C  -1.188852 1.632651 -0.4247
C  3.101423 2.537676 0.754912
C  4.611498 -1.491583 -0.819196
C  0.453202 -2.373953 0.580621
C  -4.10062 1.170822 0.173307
C  -3.685248 -1.1908 -0.365379
C  -5.489044 0.922781 0.177944
C  -5.076168 -1.426492 -0.345144
C  -5.984403 -0.375343 -0.083283
H  4.15012 1.622279 -0.917037
H  2.388492 1.835524 -1.161672
H  4.970242 0.065375 0.662841
H  3.936499 -1.291474 1.227197
H  -1.776378 2.510612 -0.678334
H  2.074345 2.653395 1.126742
H  3.801554 2.27485 1.562431
H  3.884126 -2.286563 -1.031486
H  4.83094 -0.893522 -1.716548
H  0.482586 -3.433833 0.850008
H  -3.728778 2.171686 0.415964
H  -2.979921 -2.004674 -0.546792
H  -6.181264 1.741946 0.399941
H  -5.44893 -2.438219 -0.537434
H  -7.062629 -0.566014 -0.073672
