program: Gaussian 09
title: 000264764
version: EM64L-G09RevD.01
frameworkgroup: C1[X(C16H19N5O2)]
method: RPBEPBE
basis: SDD
operation: Freq
keyword: #p
keyword: freq=noraman
keyword: PBEPBE/SDD
title: #p freq=noraman PBEPBE/SDD
converged: NO YES NO NO
title: Mulliken charges:
elementType: O O N N N N N C C C C C C C C C C C C C C C C H H H H H H H H H H H H H H H H H H H
charge: -0.509621 -0.464283 -0.131473 -0.269441 -0.089719 -0.116399 -0.050226 0.236405 -0.087762 -0.437455 -0.434770 0.104516 0.460451 -0.290156 -0.289659 -0.262222 -0.508064 -0.361599 -0.389810 0.470775 -0.213874 -0.438792 -0.811297 0.296282 0.282940 0.281194 0.237659 0.217597 0.213985 0.211458 0.190161 0.268383 0.235810 0.302165 0.243232 0.229365 0.235348 0.235892 0.226757 0.229440 0.368949 0.377856
chargesum: 0.00000
title: Mulliken charges with hydrogens summed into heavy atoms:
elementType: O O N N N N N C C C C C C C C C C C C C C C C
charge: -0.140672 -0.086427 -0.131473 -0.269441 -0.089719 -0.116399 -0.050226 0.236405 -0.087762 0.141767 0.084083 0.104516 0.460451 0.141426 0.111959 0.006161 -0.272254 -0.059434 -0.146577 0.470775 0.015491 -0.203444 -0.119207
polarizability: 3.64887833e+02 3.47915386e+00 2.13896613e+02 -1.05602346e+00 -1.03977527e+01 1.22403568e+02
1716.lowfreq: -26.0237 -11.2503 -7.1659 -3.2118 -0.0006 0.0005 0.0007 3.4342 21.5469
frequency: -25.9571 -9.9454 20.7844 40.0909 49.4239 71.1445 107.7750 124.5675 136.5044 151.3923 155.9841 198.0228 208.6608 218.1111 232.5967 247.4618 255.5833 277.8576 300.9222 302.6014 322.0649 367.7749 400.8906 424.2596 437.4389 452.8943 515.8047 519.4007 537.1142 541.3872 571.9875 594.3659 608.1591 642.6159 664.6409 669.7201 685.0743 690.5475 697.6068 780.1909 782.7132 796.6800 808.5190 828.2081 848.1695 857.6932 879.0614 887.0196 904.6830 914.8374 929.5594 967.8529 984.4186 985.9770 991.5031 1002.3681 1025.7125 1049.2620 1056.0496 1058.4269 1076.6462 1096.6542 1100.5843 1105.5481 1161.7976 1172.2842 1189.0693 1207.6824 1210.3186 1214.2217 1221.2144 1247.8985 1267.4223 1282.2538 1296.9023 1315.9043 1321.3537 1342.1256 1350.6506 1365.8809 1372.9387 1380.4765 1386.7636 1391.8055 1398.7905 1413.1913 1418.7372 1431.9615 1446.2758 1457.7275 1466.1524 1471.3309 1471.4543 1476.1945 1477.5117 1480.4866 1492.6836 1520.6063 1570.2254 1601.5923 1619.6813 2937.8364 2972.4220 2978.8500 2998.5776 3001.7689 3038.2243 3046.6313 3057.5978 3063.3423 3080.1659 3088.0292 3129.3491 3131.9448 3153.7107 3155.4073 3186.3501 3246.4876 3315.9612 3593.9523
redmass: 1.0326 4.9591 3.8902 5.3157 4.9382 5.3130 3.8775 5.7718 5.1367 3.5378 4.0574 4.2769 4.8071 3.8888 4.8148 1.2498 3.3462 4.7408 5.6412 2.3975 5.3073 4.1006 2.8026 3.1014 2.8165 3.3443 3.7019 3.9270 3.6344 2.7771 4.2782 4.5588 5.6921 4.9084 7.4705 5.2876 2.5050 1.5496 2.2027 4.1076 4.5207 1.4347 1.9367 5.0617 3.1330 5.7810 1.3810 2.6797 2.5359 1.4094 1.4269 2.6192 1.8446 1.7527 3.4361 2.0668 2.8892 1.5701 2.2608 2.3104 2.3473 2.5888 3.0716 1.9322 4.2155 2.0556 1.1116 1.8226 1.1350 1.1705 1.8861 1.7392 1.6203 3.6568 3.4809 1.3863 1.4438 4.3594 1.2928 2.5704 1.4389 2.5925 2.4566 1.3759 1.2540 1.3811 1.2454 2.5890 2.7736 1.1434 1.1069 1.3240 1.5794 1.1572 1.3795 1.1982 2.2674 7.4280 7.5413 6.0961 6.2378 1.0694 1.0564 1.0374 1.0630 1.0643 1.1061 1.0929 1.0976 1.1054 1.0987 1.0987 1.0882 1.0909 1.0952 1.0918 1.0962 1.0977 1.0686 1.0667
irintensity: 0.4642 3.2065 0.5403 2.3947 2.2916 0.2870 5.8353 11.6723 3.1061 5.9338 6.0211 0.7303 3.8112 1.6180 17.7309 125.1798 19.9793 5.1743 0.2165 3.2130 0.2930 7.6778 6.0904 4.4831 5.4505 24.1068 5.1701 7.1497 1.2593 9.5672 1.4860 1.7114 4.8080 15.6918 0.9208 6.0842 79.7376 137.8985 17.2022 19.0738 6.2288 58.0414 4.6091 14.5288 42.5225 7.8114 10.0883 1.1176 34.1372 5.5404 12.1543 67.9373 8.3676 20.5227 27.9264 97.1241 33.7706 12.0567 67.3282 32.5766 0.6715 9.8068 14.4723 2.3724 37.8474 64.2312 5.7637 91.2851 1.6042 3.8601 36.7037 4.6395 95.3186 106.1882 31.1954 94.7424 26.0332 100.5229 36.9999 13.4655 14.8252 2.1494 29.3622 4.0576 11.3595 53.9581 63.5243 4.1022 36.0291 13.0532 5.8574 22.0439 33.8457 6.1010 17.7557 8.9872 223.3019 50.8731 730.7892 22.4302 54.6181 112.5182 46.2738 35.9569 17.2262 52.4871 62.6411 53.7933 19.5509 53.4137 12.6598 19.0325 11.5106 10.9137 20.6901 23.5733 8.7234 0.2965 242.3242 10.3575
temp: 298.150 k
press: 1.00000 atm
elementType: 8 8 7 7 7 7 7 6 6 6 6 6 6 6 6 6 6 6 6 6 6 6 6 1 1 1 1 1 1 1 1 1 1 1 1 1 1 1 1 1 1 1
symmnumber: 1
zpe: 880761.0 jmol-1
zpe.correction: 0.335464 hartree
zpe.thermalcorrener: 0.354903 hartree
zpe.thermalcorrenthalpy: 0.355848 hartree
zpe.thermalcorrgfe: 0.287036 hartree
zpe.sumelectzpe: -1043.616877 hartree
zpe.sumelectthermal: -1043.597438 hartree
zpe.sumelectthermalent: -1043.596493 hartree
zpe.sumelectthermalfe: -1043.665305 hartree
dipole: -2.2380 -3.1576 -3.3760
dipole: 5.1358
quadrupole: -119.9701 -127.4549 -136.7788
quadrupole: 0.0220 -22.8369 3.4765
quadrupole: 8.0978 0.6131 -8.7109 0.0220 -22.8369 3.4765
hfenergy: -1043.952341 hartree
pointgroup: C01 [X(C16H19N5O2)]
dipole: -0.9525194 1.4140386 1.0843882 debye
polarizability: 364.7926365|3.5629072|207.6898862|5.425498|-25.1204159|128.7054916 unknown
InChI: InChI=1S/C16H19N5O2/c1-12-3-2-4-13(9-12)21-11-19-14-15(17-10-18-16(14)21)20(5-7-22)6-8-23/h2-4,9-11,22-23H,5-8H2,1H3
charge 0 multiplicity 1
42 atoms
O  5.411709 1.94702 0.850414
O  5.889349 0.413306 -1.373249
N  3.100507 0.019277 0.037598
N  -1.667569 0.24422 0.034045
N  0.25081 1.486577 -0.179674
N  1.799183 -1.920013 0.406987
N  -0.65009 -1.993258 0.444782
C  1.854415 -0.558393 0.159729
C  0.594171 0.134417 0.052174
C  3.265839 1.464157 -0.256006
C  4.320151 -0.81856 0.190303
C  -0.58982 -0.651556 0.199732
C  -3.077373 -0.042649 0.060585
C  3.959395 2.261707 0.856627
C  5.240542 -0.858369 -1.046771
C  -1.08742 1.508266 -0.182276
C  -3.971299 0.811006 -0.629099
C  -3.566513 -1.161862 0.77799
C  0.597364 -2.541997 0.531793
C  -5.368492 0.583882 -0.589342
C  -4.956036 -1.394348 0.808086
C  -5.853101 -0.529113 0.141793
C  -6.315556 1.50581 -1.338622
H  2.266978 1.905899 -0.40459
H  3.847077 1.57726 -1.189317
H  3.968913 -1.839569 0.41135
H  4.896895 -0.44611 1.058075
H  3.522857 2.018669 1.845518
H  3.816682 3.340996 0.647566
H  4.669233 -1.163897 -1.941944
H  6.013942 -1.634287 -0.850834
H  -1.688208 2.405593 -0.29892
H  -3.586542 1.647046 -1.225064
H  -2.865098 -1.838608 1.270142
H  0.635988 -3.618247 0.726843
H  -5.341022 -2.258635 1.360009
H  -6.931427 -0.721905 0.179974
H  -6.140246 1.458877 -2.430048
H  -7.36866 1.231975 -1.156906
H  -6.18228 2.559878 -1.031795
H  5.89777 2.512367 1.498242
H  5.962685 0.971171 -0.541698
