program: Gaussian 09
title: 000264765
version: EM64L-G09RevD.01
frameworkgroup: C1[X(C13H15ClN4)]
method: RPBEPBE
basis: SDD
operation: Freq
keyword: #p
keyword: freq=noraman
keyword: PBEPBE/SDD
title: #p freq=noraman PBEPBE/SDD
converged: YES YES NO NO
title: Mulliken charges:
elementType: Cl N N N N C C C C C C C C C C C C C H H H H H H H H H H H H H H H
charge: -0.054831 -0.392328 -0.072291 -0.654545 0.046837 -0.390046 -0.533345 -0.401662 0.507449 -0.422858 -0.407410 0.218292 0.267030 -0.225903 -0.229199 -0.243517 -0.278992 -0.375943 0.220701 0.208383 0.220236 0.215083 0.224117 0.256932 0.296466 0.230322 0.231680 0.223250 0.223550 0.227253 0.301142 0.317150 0.247000
chargesum: 0.00000
title: Mulliken charges with hydrogens summed into heavy atoms:
elementType: Cl N N N N C C C C C C C C C C C C C
charge: -0.054831 -0.095862 -0.072291 -0.036253 0.046837 0.039037 -0.098027 0.079387 0.507449 -0.192535 -0.175730 0.218292 0.267030 -0.002653 -0.005649 -0.016264 -0.278992 -0.128943
polarizability: 2.25911364e+02 -2.50562869e+01 1.53687556e+02 3.88003447e+00 1.95858298e+01 1.54134334e+02
1716.lowfreq: -8.0766 -0.0014 -0.0014 0.0006 2.6844 3.9830 14.1901 18.6950 20.0389
frequency: 13.8880 18.5146 19.9994 43.4090 79.9962 85.9571 135.9167 161.0693 208.6090 237.0901 259.0554 260.2706 296.4681 315.7888 333.3962 337.7956 362.8372 403.2228 446.4007 494.2609 508.9746 537.7447 556.8766 578.5596 588.3809 603.6386 616.7254 617.9531 679.2359 705.4673 752.3238 755.8924 765.0022 781.4773 807.3256 837.1466 852.9745 884.3556 898.9266 916.6209 941.9166 974.7019 989.9427 992.9127 1026.3626 1037.5306 1059.3820 1079.2251 1087.0039 1095.6704 1132.0700 1171.5331 1181.6251 1186.4250 1208.3558 1216.7379 1237.7675 1279.3106 1302.5918 1307.0264 1326.6215 1327.6093 1346.2143 1355.7664 1382.1548 1393.7729 1436.6921 1440.0500 1449.9438 1460.4691 1468.3928 1480.3812 1483.7422 1551.7110 1562.8389 1592.8401 1614.4782 1633.9485 2966.9924 2988.7141 2994.5401 3022.2894 3057.0338 3084.8298 3113.3407 3113.5108 3130.4372 3142.4730 3161.3348 3178.3383 3488.9913 3526.1718 3621.3519
redmass: 4.2484 4.8263 7.8788 3.9977 4.9063 4.6234 3.1025 5.2639 7.0133 5.8591 2.4771 3.2152 4.1194 2.6337 2.1432 1.5384 8.7346 2.8135 3.5843 3.5269 3.4609 3.1262 2.3396 2.1335 4.3671 2.3380 1.9530 5.3585 4.7611 1.7455 2.0098 9.5460 1.3487 5.8146 3.1194 3.3275 1.2559 2.3622 1.4138 1.4432 2.1932 1.3891 5.8282 1.3328 2.1962 1.8844 2.6053 2.0022 2.6695 2.0359 1.7902 1.0567 2.6320 1.1153 2.1738 2.4048 1.3559 1.2191 1.4206 4.5376 1.7279 1.5569 1.4115 1.3630 7.7545 1.7818 1.9489 2.1696 1.9736 1.1346 1.6139 1.1937 2.0686 3.6379 5.1622 6.0271 6.1662 1.2329 1.0613 1.0672 1.0602 1.0985 1.1035 1.0966 1.0878 1.0862 1.0906 1.0957 1.1015 1.0925 1.0452 1.0758 1.1009
irintensity: 1.1896 1.7130 0.1425 0.2650 0.6351 0.1609 0.7585 1.3059 0.4681 1.0594 2.1512 5.2349 1.0025 25.4638 6.1618 30.7116 8.2771 0.0054 5.0503 6.3139 9.5669 25.5824 59.0750 42.0944 19.8842 102.7331 157.6489 14.7914 22.7511 50.3984 50.2658 5.1807 6.9660 26.0629 1.8529 19.3636 0.1050 8.4487 15.1701 0.3590 5.8032 0.0076 0.0689 0.0650 7.1001 19.0018 6.3422 83.7353 74.0463 5.2722 1.0827 0.0252 19.9135 0.0961 16.6239 0.3629 39.4543 7.2820 3.0784 31.0108 26.2916 26.2846 0.6275 33.1204 0.1908 56.8476 35.6545 8.1058 81.2148 15.5874 30.9617 33.8004 15.1348 509.2557 79.7859 1.6610 11.3403 123.7186 15.9986 61.3302 48.6041 18.2248 31.1103 7.0148 6.8748 11.9630 10.4118 45.6608 25.3791 12.5696 29.0210 23.8057 29.9332
temp: 298.150 k
press: 1.00000 atm
elementType: 17 7 7 7 7 6 6 6 6 6 6 6 6 6 6 6 6 6 1 1 1 1 1 1 1 1 1 1 1 1 1 1 1
symmnumber: 1
zpe: 688843.3 jmol-1
zpe.correction: 0.262367 hartree
zpe.thermalcorrener: 0.279283 hartree
zpe.thermalcorrenthalpy: 0.280227 hartree
zpe.thermalcorrgfe: 0.213757 hartree
zpe.sumelectzpe: -1182.145534 hartree
zpe.sumelectthermal: -1182.128618 hartree
zpe.sumelectthermalent: -1182.127674 hartree
zpe.sumelectthermalfe: -1182.194143 hartree
dipole: 2.3045 -1.4450 4.9009
dipole: 5.6051
quadrupole: -122.4269 -111.1999 -107.1016
quadrupole: 1.8568 -15.2970 3.3637
quadrupole: -8.8507 2.3762 6.4745 1.8568 -15.2970 3.3637
hfenergy: -1182.4079004 hartree
pointgroup: C01 [X(C13H15Cl1N4)]
dipole: -0.8722525 0.1169365 -2.0220028 debye
polarizability: 218.0936892|28.8015212|174.8714063|17.5181698|-10.7886003|140.7681582 unknown
InChI: InChI=1S/C13H15ClN4/c14-12-11(15)13(18-9-17-12)16-8-4-7-10-5-2-1-3-6-10/h1-3,5-6,9,16H,4,7-8,15H2
charge 0 multiplicity 1
33 atoms
Cl 4.861132 2.308343 1.136208
N  1.155662 -0.35755 -1.405598
N  1.979011 -1.23159 0.648755
N  3.011506 1.77795 -1.29666
N  3.665804 -0.032331 1.906689
C  -1.285718 -1.008437 -1.315244
C  -1.551393 -0.606882 0.161772
C  0.174259 -1.444252 -1.585422
C  -3.000464 -0.20183 0.388976
C  -3.404057 1.154561 0.284593
C  -3.991278 -1.179221 0.668531
C  2.015628 -0.271878 -0.324017
C  2.95172 0.833515 -0.262694
C  -4.75806 1.525389 0.450079
C  -5.346197 -0.814579 0.835723
C  -5.735203 0.540841 0.724981
C  3.712055 0.879836 0.921398
C  2.814653 -1.076865 1.711806
H  -1.951094 -1.850376 -1.591982
H  -1.561396 -0.16535 -1.982152
H  -1.278683 -1.459969 0.811536
H  -0.875635 0.225414 0.435036
H  0.258747 -1.829757 -2.620565
H  0.46642 -2.249791 -0.891643
H  1.01456 0.500002 -1.945188
H  -2.649744 1.925691 0.081998
H  -3.695524 -2.231845 0.764815
H  -5.049728 2.579107 0.371702
H  -6.095679 -1.583129 1.057246
H  -6.784726 0.826669 0.857766
H  2.955912 1.441052 -2.259374
H  3.623703 2.581114 -1.141852
H  2.792107 -1.85075 2.48278
