program: Gaussian 09
title: 000264738
version: EM64L-G09RevD.01
frameworkgroup: C1[X(C10H11N5O3S)]
method: RPBEPBE
basis: SDD
operation: Freq
keyword: #p
keyword: freq=noraman
keyword: PBEPBE/SDD
title: #p freq=noraman PBEPBE/SDD
converged: NO YES NO NO
title: Mulliken charges:
elementType: S O O O N N N N N C C C C C C C C C C H H H H H H H H H H H
charge: 0.358962 -0.223330 -0.423044 -0.440704 -0.131961 -0.026455 -0.044792 -0.056579 -0.613394 -0.637694 -0.127846 -0.148121 0.005724 -0.220605 -0.393010 0.162438 -0.107924 0.133863 -0.378091 0.328849 0.314790 0.290062 0.268762 0.224945 0.263478 0.355887 0.344828 0.244719 0.342957 0.333285
chargesum: 0.00000
title: Mulliken charges with hydrogens summed into heavy atoms:
elementType: S O O O N N N N N C C C C C C C C C C
charge: 0.358962 -0.223330 -0.067157 -0.095876 -0.131961 -0.026455 -0.044792 -0.056579 0.062847 -0.308845 0.186944 0.141941 0.274486 -0.220605 0.095413 0.162438 -0.107924 0.133863 -0.133371
polarizability: 2.47726061e+02 3.15496352e+00 1.64542305e+02 1.15027835e+01 8.05373149e-01 9.84359479e+01
1716.lowfreq: -0.0017 -0.0007 0.0018 2.8109 7.1510 11.4774 33.7880 69.0216 80.4763
frequency: 33.6369 68.9870 80.4702 101.2589 136.1526 152.7042 177.3411 198.6927 224.7432 243.9079 256.5039 276.6216 295.1937 310.7098 316.1711 359.9447 366.5314 390.5894 404.3820 432.3842 487.8786 502.3040 533.7578 539.1858 567.7150 579.2182 632.4779 651.0862 679.4294 700.4378 719.6645 748.1160 777.0516 793.5852 802.0250 843.2935 858.4457 870.5785 927.7993 934.3073 956.1034 963.4450 983.5626 1002.4730 1018.9233 1044.1009 1048.2258 1071.6847 1136.6347 1151.3016 1176.3588 1188.0983 1202.1434 1222.9471 1242.7107 1250.0369 1282.0458 1285.7627 1293.3585 1307.5805 1319.3921 1344.2144 1347.5056 1358.2451 1364.7685 1380.8389 1396.6039 1411.6918 1451.5432 1475.2452 1540.5727 1579.7653 1632.3963 3003.9234 3018.8838 3031.7592 3096.6998 3119.5251 3123.4989 3168.4362 3542.9804 3569.9622 3571.7508 3698.4886
redmass: 6.7317 5.1543 6.3130 4.5363 6.7952 6.7849 5.4230 6.7665 3.8173 4.9779 8.2581 1.3419 2.0855 1.3374 5.2875 5.3767 5.7250 8.9976 9.5060 4.7934 6.9342 1.2498 8.9177 1.0618 4.3691 5.3514 9.9772 10.2447 11.2753 7.3872 4.5822 7.6072 4.2883 11.4704 7.5058 3.1816 5.9012 4.3640 1.4280 2.7851 3.7705 2.4231 5.0576 2.8407 3.6010 3.0192 2.4561 1.7037 2.3401 1.4099 1.2951 2.3896 2.5559 1.4841 1.9288 1.5413 1.9674 2.1908 1.6772 5.7996 1.3257 1.6900 1.4231 1.7958 1.2750 6.8797 1.5361 3.6975 4.1439 1.0732 8.6758 1.8038 2.8705 1.0674 1.0860 1.0874 1.0877 1.0900 1.0992 1.0921 1.0442 1.0665 1.0666 1.1056
irintensity: 0.5595 5.9472 0.4052 8.9838 2.3760 3.9766 16.6879 2.1719 6.2620 4.7177 0.6015 165.8716 27.0250 115.3552 3.2734 13.2307 16.9796 9.1772 6.3254 23.5358 1.6992 283.1576 6.8852 2.2494 4.8987 4.8939 12.9029 24.1441 3.3371 4.3054 2.3098 3.6496 63.3198 6.7515 77.8737 11.8521 23.6702 13.4472 12.7461 30.1895 90.5812 8.3285 176.8935 30.5372 24.8492 3.1613 4.7996 18.2778 31.9030 63.4652 23.8639 33.5422 24.0480 18.8826 24.9137 20.6349 41.1145 32.9727 16.3076 55.8506 12.7264 40.8297 14.0524 53.3837 12.8234 1.0414 0.8003 207.2720 51.9874 11.2544 74.9835 39.6991 633.3917 35.8802 25.2123 15.7399 0.9328 2.4896 6.3830 16.3576 128.1661 10.1286 24.3601 48.0157
temp: 298.150 k
press: 1.00000 atm
elementType: 16 8 8 8 7 7 7 7 7 6 6 6 6 6 6 6 6 6 6 1 1 1 1 1 1 1 1 1 1 1
symmnumber: 1
zpe: 576309.8 jmol-1
zpe.correction: 0.219505 hartree
zpe.thermalcorrener: 0.235753 hartree
zpe.thermalcorrenthalpy: 0.236697 hartree
zpe.thermalcorrgfe: 0.175984 hartree
zpe.sumelectzpe: -1283.745048 hartree
zpe.sumelectthermal: -1283.728799 hartree
zpe.sumelectthermalent: -1283.727855 hartree
zpe.sumelectthermalfe: -1283.788568 hartree
dipole: 2.1076 2.7395 1.0324
dipole: 3.6073
quadrupole: -110.0498 -123.3781 -108.1504
quadrupole: -6.4585 1.3629 -5.2751
quadrupole: 3.8096 -9.5186 5.7091 -6.4585 1.3629 -5.2751
hfenergy: -1283.9645524 hartree
pointgroup: C01 [X(C10H11N5O3S1)]
dipole: 0.7904205 -1.1778661 0.0453263 debye
polarizability: 247.4927725|-9.8212639|156.2789767|-7.5109046|-22.3800578|106.9325647 unknown
InChI: InChI=1S/C10H11N5O3S/c11-7-4-8(13-2-12-7)15-9-5(17)6(3(1-16)18-9)19-10(15)14-4/h2-3,5-6,9,16-17H,1,11H2
charge 0 multiplicity 1
30 atoms
S  1.27168 -2.325481 0.280093
O  1.797665 1.204395 0.481048
O  3.069365 0.599947 -2.075572
O  5.119165 -0.365245 1.325397
N  -0.149154 0.039173 -0.367306
N  -1.438231 -1.668266 0.480637
N  -1.923655 1.742194 -0.735707
N  -4.146213 0.909541 -0.085536
N  -4.506768 -1.25895 0.785738
C  2.563194 -0.9907 -0.209299
C  1.07366 0.774329 -0.721418
C  2.029925 -0.202666 -1.43667
C  2.728372 0.094972 0.879142
C  -0.20199 -1.27603 0.145243
C  4.153139 0.680113 0.949917
C  -1.467805 0.524364 -0.338608
C  -2.243419 -0.546836 0.179681
C  -3.643283 -0.312948 0.300677
C  -3.279735 1.848126 -0.573407
H  3.491228 -1.554971 -0.390042
H  0.802451 1.672955 -1.293596
H  1.505461 -0.851482 -2.162595
H  2.408311 -0.278534 1.869849
H  4.163618 1.532164 1.657177
H  4.463374 1.033593 -0.043679
H  3.641652 0.012468 -2.630648
H  5.032024 -0.565053 2.291182
H  -3.727487 2.801515 -0.868546
H  -4.154276 -2.16707 1.079334
H  -5.497167 -1.033721 0.849515
