program: Gaussian 09
title: 000264735
version: EM64L-G09RevD.01
frameworkgroup: C1[X(C12H9NO2)]
method: RPBEPBE
basis: SDD
operation: Freq
keyword: #p
keyword: freq=noraman
keyword: PBEPBE/SDD
title: #p freq=noraman PBEPBE/SDD
converged: YES YES NO NO
title: Mulliken charges:
elementType: O O N C C C C C C C C C C C C H H H H H H H H H
charge: -0.428204 -0.249896 -0.018256 0.276227 0.369862 -0.053129 -0.364668 -0.299309 -0.301553 -0.254424 -0.221226 -0.223195 -0.390935 -0.312230 0.154055 0.228155 0.225299 0.265154 0.250826 0.233681 0.236239 0.243451 0.252687 0.381387
chargesum: 0.00000
title: Mulliken charges with hydrogens summed into heavy atoms:
elementType: O O N C C C C C C C C C C C C
charge: -0.046816 -0.249896 -0.018256 0.276227 0.369862 -0.053129 -0.136512 -0.074011 -0.036399 -0.020743 0.029600 0.013044 -0.147484 -0.059543 0.154055
polarizability: 2.54971687e+02 -1.02336729e+01 1.70430267e+02 4.91912081e-01 -7.60131090e-01 5.60386575e+01
1716.lowfreq: -9.6751 -8.0261 -0.0009 -0.0004 -0.0003 1.5073 4.3264 63.0927 78.5135
frequency: 3.4649 63.0892 78.5105 134.0030 156.3159 173.0928 227.1177 244.2500 277.5900 407.4983 424.3316 466.6394 492.2693 502.8932 530.0742 544.3166 565.1822 596.2395 629.7737 642.0278 699.6643 734.6688 772.9291 796.3259 805.8121 851.9095 853.4886 881.0383 891.8224 939.5758 963.0862 971.6238 995.7349 1002.1567 1010.3411 1029.4071 1053.0798 1091.7276 1147.3943 1179.6290 1218.1778 1228.4048 1251.8114 1260.8617 1318.8582 1334.4296 1339.4338 1379.1076 1384.8985 1432.6669 1451.9983 1506.1704 1545.0837 1574.3813 1620.2673 1625.3782 1646.7979 3128.1743 3130.8006 3136.3547 3149.5412 3161.2037 3164.3258 3168.5049 3175.9752 3526.1233
redmass: 5.9924 5.1685 6.4019 3.2242 3.5229 4.1826 7.3814 7.3632 3.8840 5.1316 2.9670 3.0874 5.6360 6.0995 5.7147 2.5534 5.9322 1.6020 5.9602 2.6495 4.2815 5.6080 1.4106 2.7364 5.6588 1.2927 5.4350 1.7180 2.2254 4.6799 1.4129 1.3994 1.2251 1.2985 4.0787 2.1331 2.0389 2.4848 1.3458 1.2203 1.7381 1.4314 1.7008 2.4489 2.2506 1.5909 2.7874 3.2899 2.0926 2.7931 2.6222 3.4848 6.2790 6.4713 6.3232 8.1469 5.7501 1.0893 1.0889 1.0867 1.0892 1.0951 1.0949 1.0915 1.0997 1.0641
irintensity: 0.9317 0.5783 0.8644 1.7418 0.3312 5.4560 0.4832 1.5944 0.3189 7.4801 5.5157 0.6769 1.2429 33.4257 24.6247 37.1806 29.8285 80.8107 2.2148 20.5839 51.1835 0.1352 62.5361 5.3346 0.8000 37.9358 10.6939 12.7481 1.6061 2.7079 2.2975 1.2546 39.4338 11.8035 39.2954 77.0539 386.9848 62.7818 0.7911 2.3407 4.3990 6.0043 3.2552 32.4386 13.0857 7.2531 74.4753 29.2143 44.8270 21.1372 7.3299 13.1266 18.5235 2.0290 17.1228 333.3785 82.4088 19.5272 0.9835 1.0207 10.4645 14.8186 12.4258 13.2872 19.5829 62.3371
temp: 298.150 k
press: 1.00000 atm
elementType: 8 8 7 6 6 6 6 6 6 6 6 6 6 6 6 1 1 1 1 1 1 1 1 1
symmnumber: 1
zpe: 470669.7 jmol-1
zpe.correction: 0.179269 hartree
zpe.thermalcorrener: 0.191505 hartree
zpe.thermalcorrenthalpy: 0.192449 hartree
zpe.thermalcorrgfe: 0.137499 hartree
zpe.sumelectzpe: -666.840621 hartree
zpe.sumelectthermal: -666.828384 hartree
zpe.sumelectthermalent: -666.827440 hartree
zpe.sumelectthermalfe: -666.882390 hartree
dipole: -0.3692 -0.0970 -0.1627
dipole: 0.4149
quadrupole: -79.0266 -83.0106 -90.7496
quadrupole: -12.3277 0.5526 0.8284
quadrupole: 5.2357 1.2516 -6.4873 -12.3277 0.5526 0.8284
hfenergy: -667.0198893 hartree
pointgroup: C01 [X(C12H9N1O2)]
dipole: 0.1463278 -0.0389369 0.0610159 debye
dipolederiv: -1.3962527 -0.486493 -0.1978655 -0.5473275 -0.517521 -0.0564416 -0.2291037 -0.0541936 -0.4623089 -0.8902485 0.1395827 0.023011 0.3940603 -0.8817669 -0.1710628 0.0930787 -0.1712993 -0.3826114 -0.3694697 -0.005482 -0.0026465 0.1954213 -0.2455987 0.0042423 0.0242085 -0.000913 -0.2479578 -0.3080343 -0.1195277 -0.0239011 0.364089 0.0230559 -0.0020022 0.0772085 -0.0115451 0.0505131 0.0573285 0.1101936 0.023008 0.2304787 0.1072648 0.0104409 0.0605252 0.0151782 0.0195249 0.2184024 0.3065316 0.0507627 0.0066743 0.0658664 0.0022053 0.0022216 0.0007367 0.0641826 -0.0167445 -0.0876833 -0.0073811 -0.1461531 -0.0283047 0.0151011 -0.0243037 0.0177633 -0.1499989 -0.0965663 0.2077423 0.0173838 -0.0093962 -0.2557216 -0.0321459 -0.0319111 -0.0332619 -0.0867483 0.1358216 -0.0765653 -0.0101996 -0.1036716 -0.0433963 0.0153788 -0.0117655 0.0174086 -0.1412058 -0.0477432 -0.1020783 -0.0166614 -0.0948968 0.1488696 0.0429169 -0.0101862 0.0429277 -0.1372523 0.7079457 -0.0722282 0.0109168 -0.123927 0.0672827 0.049909 0.0064312 0.0429768 -0.0641859 0.1736627 0.1179631 0.02167 0.0618014 -0.086095 0.0104325 0.0077632 0.0111592 -0.1496554 0.04774 -0.2446364 -0.0372845 -0.1953019 0.3807393 0.0692657 -0.0198826 0.0705645 -0.0552048 -1.3026898 0.1239423 -0.0044923 0.1190933 0.0301659 0.0745959 -0.0140935 0.0668938 -0.1394523 2.5294342 0.12969 0.1400971 -0.3612678 1.1306145 0.2828276 0.0262718 0.290998 0.3391054 -0.0374976 0.1009765 0.0112167 0.0599697 0.0494608 -0.0131321 0.0003892 -0.0139527 0.1476841 -0.0269669 -0.1154214 -0.0134895 -0.0793455 0.0378941 -0.0149968 -0.0085809 -0.0164589 0.1387584 -0.0197968 0.0284156 0.0030666 0.0920648 0.0684871 -0.0135888 0.0121373 -0.0146347 0.1566156 0.1217558 -0.0060223 -0.0034761 0.0341849 -0.0122424 -0.0488582 -0.0042321 -0.0424903 0.131468 0.0840671 0.0118659 0.0010097 -0.0117099 -0.1110212 -0.0418486 0.0013221 -0.0409876 0.1532094 -0.0714927 -0.0966768 -0.0173188 -0.1092508 0.0314911 -0.0211138 -0.0191388 -0.0204456 0.1574175 0.0710593 0.0021618 0.0001818 0.0207343 -0.1276441 -0.0401314 0.0053156 -0.0389423 0.1240437 0.0977529 0.0369054 0.0057401 0.0466522 -0.0274257 -0.0647913 0.0128369 -0.059128 0.1501751 0.3385328 0.0968439 0.026652 0.1570239 0.1955454 -0.0572026 0.0434884 -0.058354 0.3838841 unknown
polarizability: 253.0612995|15.039073|168.5355768|6.7797704|20.4774409|59.8437347 unknown
InChI: InChI=1S/C12H9NO2/c14-12(15)6-5-9-7-8-13-11-4-2-1-3-10(9)11/h1-8,14H
charge 0 multiplicity 1
24 atoms
O  5.048938 0.623977 0.410522
O  4.108281 -1.391803 -0.283711
N  -2.474134 1.690873 0.279724
C  -1.036146 -0.33095 -0.03795
C  0.153221 0.493512 0.097529
C  -2.329773 0.325975 0.059871
C  -1.014885 -1.748169 -0.253994
C  -0.034031 1.872977 0.317911
C  -3.531112 -0.442934 -0.069726
C  -2.202974 -2.473743 -0.375904
C  1.495531 -0.095683 -0.008649
C  -3.471968 -1.819959 -0.285243
C  -1.345351 2.419222 0.403302
C  2.683973 0.529473 0.254316
C  3.95594 -0.200755 0.088335
H  -0.063304 -2.283915 -0.320823
H  0.822515 2.547234 0.410211
H  -4.480077 0.095736 0.009679
H  1.574733 -1.141153 -0.331371
H  -2.16281 -3.555852 -0.541273
H  -4.392913 -2.40441 -0.383432
H  -1.481119 3.493684 0.573369
H  2.761799 1.563683 0.601655
H  5.890567 0.106479 0.290652
