program: Gaussian 09
title: 000264758
version: EM64L-G09RevD.01
frameworkgroup: C1[X(C13H9Cl2N5O2)]
method: RPBEPBE
basis: SDD
operation: Freq
keyword: #p
keyword: freq=noraman
keyword: PBEPBE/SDD
title: #p freq=noraman PBEPBE/SDD
converged: YES YES NO NO
title: Mulliken charges:
elementType: Cl Cl O O N N N N N C C C C C C C C C C C C C H H H H H H H H H
charge: -0.045078 0.043383 -0.200690 -0.184751 -0.265353 0.000675 0.016966 -0.040863 0.068266 0.505667 0.366559 0.215714 -0.547171 -0.408906 -0.392739 0.134023 -0.365341 0.129402 -0.204473 -0.634381 -0.308708 -0.353528 0.287592 0.268506 0.273432 0.321308 0.255413 0.275424 0.263677 0.264860 0.261116
chargesum: 0.00000
title: Mulliken charges with hydrogens summed into heavy atoms:
elementType: Cl Cl O O N N N N N C C C C C C C C C C C C C
charge: -0.045078 0.043383 -0.200690 -0.184751 -0.265353 0.000675 0.016966 -0.040863 0.068266 0.505667 0.366559 0.215714 -0.259579 0.133032 -0.071431 0.134023 -0.109929 0.129402 0.070951 -0.105845 -0.308708 -0.092411
polarizability: 3.56949042e+02 -6.21247227e+00 2.15207195e+02 2.46618251e+00 5.12378814e+00 8.29386658e+01
1716.lowfreq: -4.0313 -2.5972 -0.0028 -0.0024 -0.0021 7.1122 8.8877 14.5324 28.1511
frequency: 8.4914 14.3230 28.1388 56.3647 64.5376 108.8624 117.8687 132.7759 148.1542 166.5338 180.6133 190.1353 226.5499 236.6747 279.9181 293.3136 343.8913 366.4804 375.1858 396.8871 409.3991 424.1156 530.3346 536.4651 554.5211 559.9595 589.2390 625.1060 640.1951 647.5419 665.4064 681.1136 691.0498 711.6279 716.6295 780.3261 780.9418 787.8202 800.8272 835.8855 842.1027 852.5036 891.2907 918.0377 924.8214 992.6921 1019.2822 1019.8054 1046.4857 1069.7475 1111.1831 1127.9371 1150.2838 1167.6471 1173.6435 1192.1560 1213.1883 1241.6132 1259.4966 1267.0488 1277.7483 1286.1195 1307.7202 1312.2719 1335.8182 1365.1598 1374.9942 1387.4696 1398.9860 1429.2297 1432.4667 1445.0098 1461.3639 1498.6570 1512.3243 1552.5313 1570.3591 1631.3328 3013.6037 3047.9561 3057.3569 3130.4484 3160.6414 3175.9192 3184.0262 3187.7395 3250.2715
redmass: 7.2520 11.0202 12.3213 10.6278 8.7748 10.4088 4.2376 2.9738 3.9395 16.6805 9.7126 7.7381 9.0782 5.2187 6.0767 6.9346 7.9297 4.7341 8.5983 9.6053 8.2272 3.4618 4.0853 7.7688 6.0442 6.4137 7.7355 7.2234 4.5854 7.4838 8.2413 2.7871 8.5156 5.2680 7.3628 4.8972 1.4261 5.8773 10.7603 1.6531 7.0022 1.3659 8.6571 1.4434 1.5064 1.3837 3.4499 1.9301 4.3021 3.0035 6.1708 4.5973 1.1108 4.6446 1.8522 4.9187 2.6981 3.3651 1.3605 1.8544 1.1370 2.0137 3.1951 3.3682 1.7781 4.1128 4.1309 4.4448 1.7678 1.5825 1.9695 4.3966 1.1027 7.4894 3.2379 10.0122 8.4546 6.6005 1.0623 1.0564 1.0985 1.1111 1.0895 1.0965 1.0916 1.0931 1.0982
irintensity: 1.1109 1.0157 1.3745 1.2991 1.0312 1.0187 0.7890 0.3061 1.7806 0.7182 0.7444 0.1197 2.3914 1.5124 0.5026 7.8335 2.9392 1.7283 13.2107 0.2385 0.2769 0.5411 2.9311 5.5400 15.5457 17.9992 5.5856 8.5922 7.3928 2.0344 1.2224 1.3409 8.8587 4.5810 66.1924 11.4500 4.0670 6.3793 44.6044 16.5073 1.4909 29.0512 124.0694 12.4568 29.6713 2.6064 20.3160 10.0846 5.8308 19.0571 20.2960 27.9610 1.5862 98.6291 28.6957 232.9893 50.6115 96.4734 13.4047 25.6750 0.8022 39.9615 13.9168 123.4457 93.9323 17.8385 48.7330 47.3311 64.0960 18.5666 35.5816 125.1254 8.6420 298.4176 162.1562 167.6842 3.7177 16.8758 6.7699 16.9652 0.4389 12.7573 11.0477 23.2122 9.0632 6.2412 2.1901
temp: 298.150 k
press: 1.00000 atm
elementType: 17 17 8 8 7 7 7 7 7 6 6 6 6 6 6 6 6 6 6 6 6 6 1 1 1 1 1 1 1 1 1
symmnumber: 1
zpe: 550118.9 jmol-1
zpe.correction: 0.209529 hartree
zpe.thermalcorrener: 0.228171 hartree
zpe.thermalcorrenthalpy: 0.229115 hartree
zpe.thermalcorrgfe: 0.157919 hartree
zpe.sumelectzpe: -1843.471794 hartree
zpe.sumelectthermal: -1843.453152 hartree
zpe.sumelectthermalent: -1843.452208 hartree
zpe.sumelectthermalfe: -1843.523404 hartree
dipole: -0.5261 -3.2295 0.3625
dipole: 3.2921
quadrupole: -192.3898 -148.8203 -138.9683
quadrupole: 7.2639 -1.3711 0.5367
quadrupole: -32.3303 11.2392 21.0912 7.2639 -1.3711 0.5367
hfenergy: -1843.6813232 hartree
pointgroup: C01 [X(C13H9Cl2N5O2)]
dipole: -0.0981327 -1.2832342 0.1457327 debye
polarizability: 357.0022087|5.7746392|215.1818995|-0.9753578|5.0406047|82.9107946 unknown
InChI: InChI=1S/C13H9Cl2N5O2/c14-4-3-8-1-2-9(5-10(8)20(21)22)19-7-18-11-12(15)16-6-17-13(11)19/h1-2,5-7H,3-4H2
charge 0 multiplicity 1
31 atoms
Cl -6.485665 -2.535754 0.22903
Cl 6.423785 0.645655 0.04461
O  -2.711421 3.300763 -0.060606
O  -4.526818 1.941685 -0.199408
N  1.368984 0.511126 0.127667
N  3.286992 1.794654 0.280168
N  -3.255313 2.128897 -0.090433
N  2.44971 -1.719592 -0.200622
N  4.889011 -1.573113 -0.236824
C  -0.032633 0.20452 0.099452
C  -2.86171 -0.396847 0.069655
C  -2.35856 0.938337 0.003697
C  -0.980374 1.241152 0.012058
C  -4.343624 -0.762146 0.069294
C  -0.485388 -1.137402 0.157932
C  2.455244 -0.373813 -0.015283
C  -1.865041 -1.407255 0.142687
C  3.631713 0.448561 0.077121
C  1.949575 1.792751 0.304903
C  -4.621686 -2.261662 0.218591
C  4.856423 -0.242714 -0.047565
C  3.699824 -2.253454 -0.305377
H  -0.704438 2.295325 -0.06194
H  -4.862887 -0.213344 0.875982
H  -4.817086 -0.392734 -0.858548
H  0.242168 -1.9518 0.197544
H  -2.171049 -2.455616 0.19208
H  1.348453 2.683557 0.466266
H  -4.250239 -2.860026 -0.627292
H  -4.263575 -2.677387 1.172949
H  3.767322 -3.333126 -0.456689
