program: Gaussian 09
title: 000264728
version: EM64L-G09RevD.01
frameworkgroup: C1[X(C7H8N4OS)]
method: RPBEPBE
basis: SDD
operation: Freq
keyword: #p
keyword: freq=noraman
keyword: PBEPBE/SDD
title: #p freq=noraman PBEPBE/SDD
converged: YES YES NO NO
title: Mulliken charges:
elementType: S O N N N N C C C C C C C H H H H H H H H
charge: 0.294426 -0.425714 -0.172995 -0.075285 -0.096528 0.013362 0.192716 0.142578 -0.224589 -0.290591 -0.355867 -0.366634 -0.833372 0.274785 0.232668 0.231130 0.253931 0.386805 0.283747 0.286371 0.249056
chargesum: 0.00000
title: Mulliken charges with hydrogens summed into heavy atoms:
elementType: S O N N N N C C C C C C C
charge: 0.294426 -0.038909 -0.172995 -0.075285 -0.096528 0.013362 0.192716 0.142578 0.050195 0.173207 -0.355867 -0.112703 -0.014197
polarizability: 1.78234105e+02 -1.98127648e+00 1.38755136e+02 4.04956650e+00 -2.35958294e-01 5.86543289e+01
1716.lowfreq: -2.7529 -0.9454 -0.0009 -0.0009 0.0015 9.0197 46.0648 62.6827 92.2770
frequency: 46.0548 62.6746 92.2671 138.9723 156.3140 163.9761 201.1777 248.1952 266.4425 288.8053 369.5386 428.9543 501.2898 531.4501 548.5062 617.1764 632.5202 643.3836 651.3972 672.4651 734.4885 792.2365 821.7754 835.4597 909.4078 926.2230 973.3033 991.7407 1001.7911 1018.8830 1088.3489 1119.9255 1169.0896 1185.2032 1235.6205 1279.6583 1298.8235 1324.4433 1346.3685 1354.9376 1377.3359 1391.1412 1406.2533 1439.8528 1440.7583 1446.4042 1476.7310 1516.1305 1544.5115 2981.5511 3031.1916 3104.5827 3152.9701 3171.9933 3178.5082 3232.9376 3391.7608
redmass: 3.6790 6.7227 4.4142 1.7559 2.0974 3.6155 3.4862 4.4626 5.4813 4.8915 10.8039 7.1183 5.0868 4.4573 7.7928 1.6794 5.1958 2.6395 6.5938 7.5198 6.1691 5.4977 10.7664 1.5870 6.5397 1.4292 1.1848 2.9888 1.3568 2.1637 5.6175 5.5821 2.1437 2.3554 1.8696 5.0465 4.9929 2.4697 1.8414 1.1611 2.2444 1.7669 1.3212 1.2968 1.1154 1.4906 1.2739 8.4693 7.5387 1.0674 1.0293 1.0983 1.1034 1.1056 1.0927 1.0986 1.0660
irintensity: 2.5971 3.4215 4.6724 0.3873 0.9318 2.6251 3.5414 4.3352 5.5845 0.6627 3.2744 2.3907 5.1760 1.8434 2.5629 176.0622 16.5794 80.8984 7.0363 5.5582 106.5110 14.2622 28.4255 13.6226 59.3426 10.9818 6.9185 129.2975 10.3084 24.5309 7.1072 37.7237 195.3280 10.5989 24.3985 48.5466 60.0083 1.8029 17.8318 4.9413 7.6504 81.7729 105.0108 26.7716 17.0510 2.4715 4.1242 273.9182 52.2171 64.6125 15.4349 18.6328 9.8787 7.8998 13.6285 0.0529 81.2636
temp: 298.150 k
press: 1.00000 atm
elementType: 16 8 7 7 7 7 6 6 6 6 6 6 6 1 1 1 1 1 1 1 1
symmnumber: 1
zpe: 400473.3 jmol-1
zpe.correction: 0.152532 hartree
zpe.thermalcorrener: 0.164334 hartree
zpe.thermalcorrenthalpy: 0.165278 hartree
zpe.thermalcorrgfe: 0.113624 hartree
zpe.sumelectzpe: -962.869952 hartree
zpe.sumelectthermal: -962.858150 hartree
zpe.sumelectthermalent: -962.857205 hartree
zpe.sumelectthermalfe: -962.908859 hartree
dipole: -1.2538 -3.0827 -1.4884
dipole: 3.6456
quadrupole: -84.6263 -78.8273 -85.2808
quadrupole: -1.4580 6.7454 0.7361
quadrupole: -1.7148 4.0841 -2.3693 -1.4580 6.7454 0.7361
hfenergy: -963.0224837 hartree
pointgroup: C01 [X(C7H8N4O1S1)]
dipole: -0.5303297 1.2894462 0.3364868 debye
dipolederiv: -0.6956384 -0.3350625 0.1473938 -0.1920871 0.044651 -0.0035621 0.1173697 0.0145187 -0.0694213 -0.8161988 -0.0972907 0.133299 -0.2481302 -0.5718699 -0.1554611 0.0059293 -0.1336896 -0.4638257 -1.0371572 0.0463385 0.0410411 -0.2219952 -0.4918943 0.0488542 0.1218018 0.0399521 -0.2036629 -0.6040455 0.0148425 0.0268418 0.0657482 -0.3655938 0.0240455 0.0232492 0.0417031 -0.2309383 -0.8425875 -0.0036274 0.0560653 0.0631413 -0.5595571 0.0817431 -0.0056735 0.1091794 -0.2229519 -0.8844661 -0.2295019 0.1218031 -0.5901254 -0.7572769 0.2058138 0.2168383 0.1622005 -0.2478996 0.6304683 -0.3341248 0.029389 -0.0219233 0.3591303 -0.0464795 0.0078545 -0.0211171 0.1137494 -0.8077717 -0.0103891 0.0949298 -0.1073345 0.1145994 -0.003928 0.1302192 -0.0217386 0.0733095 0.5307795 0.1450346 -0.0936034 0.4610895 0.2868613 -0.1283726 -0.1892248 -0.115076 -0.0042106 1.2398114 0.0757741 -0.0605342 0.2699733 0.5665269 0.1617477 -0.0851509 0.1313397 0.5675701 1.6208229 0.3946595 -0.2613194 0.4627951 0.4310563 -0.1512225 -0.2896372 -0.1467415 0.084055 0.8496732 0.0712088 -0.1122596 0.0289445 0.5490636 -0.1528156 -0.0984057 -0.1463411 0.0021687 0.0205363 0.0940282 -0.0226469 0.0560547 0.1301148 -0.0281881 -0.0135188 -0.0328814 0.0427699 0.0529991 0.062092 -0.0042057 0.0369457 0.0593828 0.0262598 0.0030914 0.0265364 0.1706714 -0.0465478 -0.0184602 -0.022179 -0.0825016 0.0414301 0.0021082 0.0724289 -0.0636632 -0.1746831 0.0223094 0.0293282 -0.0061264 0.0854045 -0.0663483 0.0177444 -0.0335132 0.0664028 0.0717648 0.0757735 -0.0314174 0.0117735 -0.0329777 -0.0510308 0.048999 0.0137408 0.0466032 0.1217055 0.613598 0.0953311 -0.0769862 0.057481 0.2564256 0.0240891 -0.0223662 0.0279631 0.2676254 0.1105428 0.0622244 0.0548048 -0.0101747 -0.0394396 -0.0401104 0.0626958 -0.0326578 -0.0097301 0.0815568 0.0304631 -0.0994077 -0.0332661 -0.0017757 0.0475056 -0.0758363 0.0246679 -0.0108689 -0.114458 -0.061451 0.0419274 -0.0470622 0.0655445 0.0212297 0.0381078 0.0228393 0.1228026 unknown
polarizability: 177.1807904|1.8378437|134.9196226|-10.673698|-17.7875457|63.5431563 unknown
InChI: InChI=1S/C7H8N4OS/c1-13-7-5-6(8-2-9-7)11(4-12)3-10-5/h2-3,12H,4H2,1H3
charge 0 multiplicity 1
21 atoms
S  3.424016 -0.476504 -0.397367
O  -3.559095 -0.860488 -0.576093
N  -1.633357 0.512295 -0.099151
N  0.420915 1.429313 -0.558807
N  -0.978995 -1.804645 0.388559
N  1.436282 -2.138207 0.228027
C  -0.704775 -0.511268 0.060936
C  0.576908 0.064281 -0.221222
C  -0.903919 1.647633 -0.479559
C  -3.089373 0.30347 0.124365
C  1.676597 -0.833877 -0.117529
C  0.160462 -2.56043 0.45594
C  3.458036 1.354963 -0.851404
H  -1.385218 2.602083 -0.683172
H  -3.250869 0.218956 1.218341
H  -3.634174 1.172204 -0.275334
H  0.037653 -3.614712 0.71659
H  -3.050688 -1.650617 -0.229111
H  3.062341 1.962089 -0.027301
H  2.868489 1.53599 -1.758895
H  4.523764 1.572774 -1.023513
