program: Gaussian 09
title: 000264761
version: EM64L-G09RevD.01
frameworkgroup: C1[X(C16H17Cl2N5)]
method: RPBEPBE
basis: SDD
operation: Freq
keyword: #p
keyword: freq=noraman
keyword: PBEPBE/SDD
title: #p freq=noraman PBEPBE/SDD
converged: YES YES NO NO
title: Mulliken charges:
elementType: Cl Cl N N N N N C C C C C C C C C C C C C C C C H H H H H H H H H H H H H H H H H
charge: -0.056588 -0.059254 -0.147029 -0.268756 -0.077974 -0.092650 -0.037399 0.213735 -0.092405 0.104867 -0.344395 -0.310874 0.464623 -0.249552 -0.588629 -0.592240 -0.507261 -0.360563 0.470185 -0.386603 -0.212618 -0.436757 -0.809969 0.236684 0.288194 0.273469 0.228798 0.274400 0.307006 0.255722 0.254369 0.309495 0.238016 0.298990 0.248942 0.231174 0.237189 0.236080 0.227872 0.231708
chargesum: 0.00000
title: Mulliken charges with hydrogens summed into heavy atoms:
elementType: Cl Cl N N N N N C C C C C C C C C C C C C C C C
charge: -0.056588 -0.059254 -0.147029 -0.268756 -0.077974 -0.092650 -0.037399 0.213735 -0.092405 0.104867 0.180483 0.191392 0.464623 0.024848 -0.025901 -0.028376 -0.269245 -0.061573 0.470185 -0.137661 0.018556 -0.199568 -0.114310
polarizability: 3.70733109e+02 6.81735332e+00 2.41734047e+02 -1.13548955e+01 1.38033519e+01 1.18688989e+02
1716.lowfreq: -13.9810 -6.6725 -0.0028 -0.0024 -0.0024 4.1848 4.9007 17.9103 29.2354
frequency: -13.8160 17.7225 29.2204 32.1702 40.3422 41.7903 72.9122 75.2432 92.3767 100.3281 145.0189 181.7809 195.8287 206.0382 211.9619 222.3951 226.8984 239.8405 262.1171 318.9658 337.3750 377.4367 399.6648 400.8168 437.9080 456.3867 518.0664 536.0906 544.8977 573.1355 599.6463 620.2101 642.5154 665.3383 673.3644 685.8242 689.1491 696.4778 712.8971 774.1394 775.2236 786.9659 796.4950 818.0198 824.9741 848.3387 878.9053 903.4863 914.6043 930.5999 972.0354 985.2432 990.9278 999.6486 1002.9572 1039.1297 1041.4219 1049.7124 1056.4738 1084.6528 1098.1701 1103.1466 1125.0560 1158.2556 1189.5809 1199.1245 1207.7568 1229.4757 1251.4118 1257.1848 1262.9073 1282.2006 1291.1405 1305.8682 1313.1517 1320.9018 1328.5658 1360.5895 1364.8879 1370.9435 1381.7249 1392.8305 1399.3694 1423.1452 1437.9356 1440.2589 1451.2338 1454.9504 1460.6871 1471.5445 1475.8437 1480.0925 1492.6993 1524.0882 1570.2848 1601.4050 1619.2086 2979.8614 3030.0463 3033.9976 3058.6036 3060.9926 3065.7228 3089.5302 3098.5731 3103.2174 3130.6832 3132.7811 3154.3879 3154.6173 3158.8801 3163.8138 3188.2197 3247.2711
redmass: 1.0537 4.3651 7.0714 7.1842 13.6502 8.7356 2.4022 6.5078 4.2714 2.5127 6.4112 7.3857 4.6340 3.7137 3.8222 5.6088 5.3985 4.1078 5.1002 5.2202 4.5016 4.1337 4.5697 4.0186 2.8264 5.3545 5.0587 4.4941 4.1108 4.4113 6.4149 6.4761 5.0560 7.4898 7.3580 6.8526 4.8703 2.2321 5.0758 1.1996 1.2180 4.8524 1.4271 2.2523 3.3473 6.3260 1.3726 5.0491 1.4124 1.4278 2.3110 1.5639 3.5626 1.5386 1.7524 2.2767 2.6598 1.5645 4.1059 2.0991 4.3727 1.7080 1.5804 3.8460 1.1170 1.8232 1.8735 2.2698 1.7257 1.2826 1.1917 3.0698 2.0464 1.5395 1.6412 1.5744 5.4601 1.2526 2.3909 1.5075 5.2750 1.7959 1.2487 2.6719 1.9074 1.1175 1.3958 1.1548 1.7977 1.0473 1.5567 1.3964 2.2929 7.7776 7.6098 6.0787 6.2767 1.0375 1.0600 1.0599 1.0977 1.0571 1.0569 1.0987 1.1036 1.1044 1.0885 1.0907 1.1117 1.0955 1.1115 1.0921 1.0959 1.0981
irintensity: 0.5284 0.0683 0.0907 0.3433 0.5565 0.5486 0.9817 2.0521 1.0500 2.4347 1.3559 2.2504 2.3966 2.7564 0.9381 4.8573 3.5878 1.7450 2.3162 0.8799 2.1708 6.3676 9.1188 3.9647 5.3969 13.4697 1.5334 1.7985 3.9962 2.4481 0.0837 13.4099 14.7539 15.2200 51.0346 2.8633 56.3110 36.5973 16.5226 1.3595 32.9718 13.0537 58.4896 19.6161 13.1040 12.6452 10.0654 4.3115 5.4399 12.4172 26.4839 0.5521 5.8006 3.7102 18.9349 1.9878 1.1776 12.6198 1.3115 29.3182 11.0966 13.4659 23.9536 38.9818 3.3514 18.3655 38.1021 7.1595 17.8247 17.4115 31.1054 41.3561 111.2053 15.5447 8.4965 5.5290 142.7572 11.3233 67.6748 6.5744 10.6069 10.0183 12.0279 60.9830 30.4747 2.2094 66.8602 11.5590 19.9751 14.7359 7.0646 27.5867 183.8103 48.7143 855.9326 15.2696 47.1417 33.4080 0.5288 50.0668 18.4632 14.1190 28.1367 18.6620 1.8363 2.8260 11.0250 9.8472 9.1707 20.8265 9.3905 15.3409 6.5674 0.5009
temp: 298.150 k
press: 1.00000 atm
elementType: 17 17 7 7 7 7 7 6 6 6 6 6 6 6 6 6 6 6 6 6 6 6 6 1 1 1 1 1 1 1 1 1 1 1 1 1 1 1 1 1
symmnumber: 1
zpe: 811683.8 jmol-1
zpe.correction: 0.309154 hartree
zpe.thermalcorrener: 0.329994 hartree
zpe.thermalcorrenthalpy: 0.330938 hartree
zpe.thermalcorrgfe: 0.255671 hartree
zpe.sumelectzpe: -1812.133773 hartree
zpe.sumelectthermal: -1812.112933 hartree
zpe.sumelectthermalent: -1812.111989 hartree
zpe.sumelectthermalfe: -1812.187256 hartree
dipole: 4.7648 0.8765 -0.0313
dipole: 4.8449
quadrupole: -139.7157 -161.8515 -148.7858
quadrupole: 2.0340 -2.0059 4.7966
quadrupole: 10.4020 -11.7338 1.3318 2.0340 -2.0059 4.7966
hfenergy: -1812.4429275 hartree
pointgroup: C01 [X(C16H17Cl2N5)]
dipole: -1.8762753 0.3349812 -0.0261427 debye
polarizability: 371.1378617|-5.940429|241.4287404|-6.4335276|-14.9893612|118.5895422 unknown
InChI: InChI=1S/C16H17Cl2N5/c1-12-3-2-4-13(9-12)23-11-21-14-15(19-10-20-16(14)23)22(7-5-17)8-6-18/h2-4,9-11H,5-8H2,1H3
charge 0 multiplicity 1
40 atoms
Cl 3.733728 4.205029 0.514188
Cl 6.571677 -2.027215 0.453995
N  3.215217 0.219584 -0.534284
N  -1.514112 0.239142 0.006904
N  0.348057 1.577283 -0.174145
N  2.029321 -1.808917 -0.33517
N  -0.402496 -1.992451 -0.089432
C  2.00438 -0.429434 -0.367441
C  0.734134 0.220595 -0.231172
C  -0.408589 -0.628327 -0.103349
C  3.312681 1.695651 -0.631943
C  4.451693 -0.59271 -0.662443
C  -2.90802 -0.102551 0.129742
C  -0.983733 1.543477 -0.033002
C  3.421806 2.358188 0.753319
C  4.955773 -1.080973 0.705817
C  -3.887957 0.819982 -0.307974
C  -3.291192 -1.345108 0.69089
C  -5.267724 0.533569 -0.165224
C  0.859169 -2.497147 -0.209369
C  -4.664051 -1.635296 0.821295
C  -5.645717 -0.706394 0.407905
C  -6.310293 1.531385 -0.640121
H  4.20439 1.942623 -1.233443
H  2.422036 2.098938 -1.139156
H  4.243495 -1.471526 -1.294487
H  5.222251 0.028714 -1.149775
H  -1.609427 2.423682 0.084776
H  2.477057 2.28577 1.309439
H  4.273933 1.988463 1.342929
H  5.200265 -0.258604 1.394346
H  4.253878 -1.793992 1.158649
H  -3.587211 1.759437 -0.7865
H  -2.52805 -2.066532 0.989535
H  0.946479 -3.587583 -0.199607
H  -4.96897 -2.594692 1.252845
H  -6.709013 -0.946566 0.521357
H  -6.236168 1.700406 -1.730903
H  -7.33228 1.176423 -0.425098
H  -6.183917 2.513877 -0.148488
