program: Gaussian 09
title: 000264734
version: EM64L-G09RevD.01
frameworkgroup: C1[X(C15H11NO2)]
method: RPBEPBE
basis: SDD
operation: Freq
keyword: #p
keyword: freq=noraman
keyword: PBEPBE/SDD
title: #p freq=noraman PBEPBE/SDD
converged: YES YES NO NO
title: Mulliken charges:
elementType: O O N C C C C C C C C C C C C C C C H H H H H H H H H H H
charge: -0.176907 -0.136917 -0.244751 0.348256 -0.574984 0.173058 0.060574 -0.059328 0.516210 -0.315984 -0.334839 -0.198795 -0.249781 -0.451548 -0.360613 -0.218058 -0.223978 -0.239957 0.238802 0.266595 0.264266 0.271413 0.233319 0.239315 0.233806 0.247074 0.229756 0.231298 0.232697
chargesum: 0.00000
title: Mulliken charges with hydrogens summed into heavy atoms:
elementType: O O N C C C C C C C C C C C C C C C
charge: -0.176907 -0.136917 -0.244751 0.348256 -0.069588 0.173058 0.060574 -0.059328 0.516210 -0.051718 -0.063425 0.034524 -0.010466 -0.217742 -0.113539 0.011698 0.007321 -0.007260
polarizability: 1.95403740e+02 1.63819926e+01 1.86843549e+02 -1.36552050e+01 -7.33921328e+00 1.19684593e+02
1716.lowfreq: -7.9289 -1.4594 -0.0007 0.0004 0.0005 3.2301 16.3078 37.6967 43.4713
frequency: 16.0591 37.6850 43.4553 100.4084 128.2919 161.7286 172.4498 235.9002 258.9215 301.2847 312.0045 344.3230 398.7277 403.1223 454.7466 468.5173 473.8357 536.7272 544.3425 555.0253 615.1085 623.4106 683.9353 694.4912 705.7083 719.9173 750.8476 761.9266 802.8495 811.6947 846.6924 855.8842 877.2441 908.1370 926.7743 960.7954 979.6499 990.2618 991.5414 996.0724 1000.8977 1015.5825 1026.9790 1040.4495 1086.5314 1092.2550 1155.6568 1174.1378 1177.7207 1188.4914 1194.9358 1211.3859 1273.1051 1302.6009 1323.0062 1335.2820 1364.9149 1388.3447 1402.0907 1443.5004 1456.8231 1463.7829 1466.6510 1485.5462 1596.1965 1598.6997 1615.0925 1619.5056 1652.5226 1660.0974 2984.8108 3039.6172 3112.0616 3125.5371 3136.5090 3138.9517 3148.3000 3151.6666 3165.8294 3168.4963 3177.6139
redmass: 4.4555 4.6367 5.8031 10.4326 4.4719 5.8017 4.6401 5.4571 4.7849 7.1476 4.7407 3.4565 3.9469 2.8046 3.4301 5.1655 7.1013 6.3543 4.3690 6.1064 6.0533 5.6907 6.4673 5.5460 1.9286 3.4638 1.9768 1.4895 3.6146 4.1278 4.0069 1.2496 1.4700 2.4181 1.9848 1.4080 1.3914 5.0465 1.4145 2.2377 1.6259 3.2016 2.1884 2.5816 1.7458 1.9115 1.8086 1.0568 1.3803 1.1132 2.1218 2.8495 1.3950 1.7859 2.8317 1.4206 1.7302 4.6049 4.8263 2.1166 1.5802 2.8277 1.6749 2.1678 6.3504 7.1412 6.1049 8.1051 11.3940 11.8640 1.0593 1.1024 1.0883 1.0864 1.0908 1.0867 1.0959 1.0908 1.1014 1.0954 1.0991
irintensity: 0.9295 1.6726 0.1109 0.3040 1.3450 1.2294 0.8025 1.2645 4.3361 2.7467 1.9747 1.6928 0.5013 0.2693 7.4632 22.7864 1.3105 6.2152 0.9755 12.1097 2.0836 9.4334 5.8502 2.1770 48.5313 9.6607 37.6888 83.5127 7.7401 12.2372 9.6767 0.1314 1.1246 11.8098 0.1902 3.0187 0.0999 0.7031 0.0774 27.1161 13.4780 0.5508 9.4048 0.9964 36.7383 10.2762 18.2704 0.3528 30.2943 1.5915 3.1037 2.6792 0.6013 34.0399 75.8493 19.0479 1.6698 2.8834 36.1124 14.0329 45.3859 6.1428 132.0621 13.4026 10.2549 77.7622 13.8024 401.0068 196.1072 32.5829 27.0774 7.8794 9.9170 2.1775 8.6388 2.9132 32.2373 4.3628 22.0504 16.3626 10.5334
temp: 298.150 k
press: 1.00000 atm
elementType: 8 8 7 6 6 6 6 6 6 6 6 6 6 6 6 6 6 6 1 1 1 1 1 1 1 1 1 1 1
symmnumber: 1
zpe: 577872.1 jmol-1
zpe.correction: 0.220100 hartree
zpe.thermalcorrener: 0.234295 hartree
zpe.thermalcorrenthalpy: 0.235239 hartree
zpe.thermalcorrgfe: 0.176868 hartree
zpe.sumelectzpe: -782.169284 hartree
zpe.sumelectthermal: -782.155090 hartree
zpe.sumelectthermalent: -782.154146 hartree
zpe.sumelectthermalfe: -782.212516 hartree
dipole: 3.4129 5.9520 -1.0539
dipole: 6.9416
quadrupole: -103.3281 -111.5005 -97.7428
quadrupole: -10.9206 1.0286 -0.6470
quadrupole: 0.8624 -7.3101 6.4477 -10.9206 1.0286 -0.6470
hfenergy: -782.3893843 hartree
pointgroup: C01 [X(C15H11N1O2)]
dipole: -0.7899407 -2.5983685 0.2880122 debye
polarizability: 186.7334279|19.8050085|194.1692296|10.2208507|-10.5448461|121.0292238 unknown
InChI: InChI=1S/C15H11NO2/c17-14-12-8-4-5-9-13(12)16(15(14)18)10-11-6-2-1-3-7-11/h1-9H,10H2
charge 0 multiplicity 1
29 atoms
O  0.394712 2.979113 -1.373255
O  3.08249 2.698755 0.066562
N  0.33494 0.643017 -0.955277
C  1.191781 -0.311524 -0.337061
C  -0.950215 0.353282 -1.61108
C  2.376207 0.324866 0.142821
C  0.902893 1.931569 -0.909232
C  2.282017 1.764036 -0.170428
C  -2.03706 -0.14472 -0.660802
C  0.995536 -1.693428 -0.177988
C  3.384726 -0.414488 0.78862
C  2.020592 -2.429272 0.472975
C  3.201807 -1.808095 0.952311
C  -2.808467 -1.283783 -0.995135
C  -2.314375 0.546871 0.544991
C  -3.845143 -1.726303 -0.141352
C  -3.345408 0.104023 1.401224
C  -4.114924 -1.033906 1.060692
H  -0.789347 -0.381735 -2.423504
H  -1.25639 1.30895 -2.078902
H  0.083868 -2.189624 -0.521262
H  4.286178 0.09156 1.149603
H  1.889009 -3.508429 0.610866
H  3.968312 -2.409851 1.450268
H  -2.604083 -1.823776 -1.92883
H  -1.725231 1.432724 0.810606
H  -4.437106 -2.607717 -0.412106
H  -3.552069 0.646136 2.330649
H  -4.915849 -1.375849 1.725423
