program: Gaussian 09
title: 000264737
version: EM64L-G09RevD.01
frameworkgroup: C1[X(C10H11N5O3S)]
method: RPBEPBE
basis: SDD
operation: Freq
keyword: #p
keyword: freq=noraman
keyword: PBEPBE/SDD
title: #p freq=noraman PBEPBE/SDD
converged: YES YES NO NO
title: Mulliken charges:
elementType: S O O O N N N N N C C C C C C C C C C H H H H H H H H H H H
charge: 0.323841 -0.235146 -0.436966 -0.449902 -0.172318 -0.014666 -0.078090 -0.054642 -0.611846 -0.651142 -0.024293 -0.045848 -0.074677 -0.212443 -0.350751 0.159339 -0.082097 0.138038 -0.370245 0.318693 0.296693 0.275864 0.244315 0.215025 0.222460 0.356808 0.387535 0.246489 0.344739 0.335235
chargesum: 0.00000
title: Mulliken charges with hydrogens summed into heavy atoms:
elementType: S O O O N N N N N C C C C C C C C C C
charge: 0.323841 -0.235146 -0.080158 -0.062367 -0.172318 -0.014666 -0.078090 -0.054642 0.068128 -0.332449 0.272400 0.230016 0.169637 -0.212443 0.086733 0.159339 -0.082097 0.138038 -0.123757
polarizability: 2.25890755e+02 8.24695388e+00 1.69380081e+02 1.45783659e+01 -1.50432278e+01 1.05248507e+02
1716.lowfreq: -7.3231 -0.0016 -0.0015 -0.0010 4.0452 13.3840 47.4474 56.5957 74.0396
frequency: 47.1856 56.5503 74.0344 112.3107 128.1100 145.9493 174.1363 198.3826 213.7519 232.5756 268.4886 289.0228 307.7105 319.4657 360.4052 386.7656 400.0968 420.4454 430.6103 516.0919 532.3656 541.5146 545.0385 565.0935 579.3063 616.7440 630.2981 644.0728 648.8744 665.3306 686.9480 755.6668 772.5727 788.1551 800.8911 828.0062 874.9669 881.2213 931.1468 938.5085 959.5675 969.4731 992.9183 1017.8163 1032.1129 1039.2664 1048.7999 1090.1933 1157.6948 1173.8793 1179.7512 1196.7553 1212.2620 1220.3812 1236.3886 1257.2967 1278.8437 1290.5122 1301.7107 1309.7480 1323.8108 1326.5012 1354.6457 1362.6791 1366.4856 1401.3586 1407.8782 1426.1128 1456.7918 1456.9780 1537.3351 1582.2130 1634.2586 2982.3821 3002.5837 3033.0696 3063.7136 3071.9434 3109.4597 3168.9446 3409.2880 3540.9481 3575.5590 3695.7055
redmass: 6.8973 5.5393 6.0337 4.7938 7.3499 8.3842 6.4505 5.2965 6.7715 3.5086 5.1903 7.0190 1.1556 5.4781 9.0279 4.7014 5.2962 4.4445 7.7358 1.2375 8.8268 3.5766 1.2175 4.2577 5.3722 1.9290 2.8672 3.4769 6.9958 7.4235 7.8593 5.7753 8.2197 10.9896 5.2304 3.3499 8.7382 2.6443 1.4297 3.0872 2.6107 2.2881 4.5838 4.8357 6.3355 4.1783 2.2619 2.2988 1.8902 1.4304 1.8833 1.7719 2.4977 1.2805 2.1459 1.8313 2.6992 1.3869 1.7791 3.3446 1.4501 1.9764 1.2340 1.7080 1.2514 5.2287 1.4841 3.3521 2.4368 1.3986 7.5121 1.8368 2.8768 1.0647 1.0859 1.0857 1.0884 1.0994 1.0880 1.0922 1.0685 1.0444 1.0665 1.1056
irintensity: 0.4165 2.9007 0.8395 2.6523 6.6922 3.6927 3.7115 8.3828 5.8787 8.8586 3.3053 1.4037 124.7649 4.2331 6.1156 7.3574 6.5438 2.4824 2.4021 287.6965 10.1777 7.5068 4.1881 8.4103 10.4755 53.0179 43.0872 81.0264 31.1829 15.6110 7.0223 5.1960 14.1488 8.3660 16.4385 38.6375 2.7536 16.9167 12.2875 21.0730 25.6177 0.8646 111.7937 8.4571 55.6004 118.0041 12.5633 52.2033 33.4975 6.5663 13.8866 3.7530 69.7628 45.5527 67.4613 48.9222 18.1620 3.1280 25.4274 30.0916 38.7994 30.6201 46.5088 18.5596 1.2369 23.6520 2.0098 133.5067 52.9068 21.9380 83.2887 46.0024 645.8069 56.5924 4.8159 47.3935 16.0359 19.7126 3.0812 13.9072 166.0184 134.0871 17.0616 49.5105
temp: 298.150 k
press: 1.00000 atm
elementType: 16 8 8 8 7 7 7 7 7 6 6 6 6 6 6 6 6 6 6 1 1 1 1 1 1 1 1 1 1 1
symmnumber: 1
zpe: 577585.9 jmol-1
zpe.correction: 0.219991 hartree
zpe.thermalcorrener: 0.235920 hartree
zpe.thermalcorrenthalpy: 0.236864 hartree
zpe.thermalcorrgfe: 0.176872 hartree
zpe.sumelectzpe: -1283.745990 hartree
zpe.sumelectthermal: -1283.730062 hartree
zpe.sumelectthermalent: -1283.729118 hartree
zpe.sumelectthermalfe: -1283.789109 hartree
dipole: 1.5506 2.4339 -0.2485
dipole: 2.8965
quadrupole: -105.0866 -119.3856 -116.6151
quadrupole: -4.5157 3.5632 -2.4091
quadrupole: 8.6092 -5.6899 -2.9193 -4.5157 3.5632 -2.4091
hfenergy: -1283.9659813 hartree
pointgroup: C01 [X(C10H11N5O3S1)]
dipole: 0.6350278 -0.94289 -0.0795928 debye
polarizability: 219.0216535|-6.7251083|171.0595764|-32.5966934|-9.0329817|110.4381134 unknown
InChI: InChI=1S/C10H11N5O3S/c11-7-4-8(13-2-12-7)15-9-6(19-10(15)14-4)5(17)3(1-16)18-9/h2-3,5-6,9,16-17H,1,11H2
charge 0 multiplicity 1
30 atoms
S  1.630177 -2.736772 -0.528983
O  1.784063 1.210288 -1.378407
O  4.35868 -0.492382 0.479853
O  1.019593 1.90669 1.280368
N  0.126367 -0.510805 -0.714076
N  -1.024621 -2.142675 0.438592
N  -1.492684 1.372412 -0.486273
N  -3.527225 0.679919 0.711621
N  -3.841594 -1.502431 1.562417
C  2.414269 -1.066025 -1.02066
C  1.293148 -0.137994 -1.557085
C  2.953082 -0.242645 0.185692
C  2.818067 1.224295 -0.284563
C  0.09983 -1.822571 -0.203241
C  2.351943 2.226375 0.781639
C  -1.084075 0.079736 -0.339004
C  -1.786672 -0.951107 0.354381
C  -3.062964 -0.606166 0.882684
C  -2.731322 1.5797 0.064715
H  3.202563 -1.249761 -1.765994
H  1.037239 -0.24442 -2.624006
H  2.309055 -0.414955 1.071292
H  3.776641 1.546064 -0.733353
H  2.390457 3.249585 0.35595
H  3.030474 2.178665 1.651267
H  4.438942 -1.301818 1.043968
H  0.347836 2.062201 0.55746
H  -3.127475 2.596088 -0.016694
H  -3.509893 -2.452351 1.715062
H  -4.7382 -1.19404 1.932677
