program: Gaussian 09
title: 000264729
version: EM64L-G09RevD.01
frameworkgroup: C1[X(C14H10ClF3O)]
method: RPBEPBE
basis: SDD
operation: Freq
keyword: #p
keyword: freq=noraman
keyword: PBEPBE/SDD
title: #p freq=noraman PBEPBE/SDD
converged: YES YES NO NO
title: Mulliken charges:
elementType: Cl F F F O C C C C C C C C C C C C C C H H H H H H H H H H
charge: -0.065552 -0.166984 -0.166651 -0.168443 -0.467753 -0.354907 0.450990 0.549510 -0.490448 0.315829 -0.375657 -0.380251 -0.345769 -0.389741 -0.203178 0.243963 -0.225806 -0.225028 -0.226853 0.251996 0.315997 0.250796 0.273291 0.267002 0.237004 0.360092 0.259971 0.237256 0.239324
chargesum: 0.00000
title: Mulliken charges with hydrogens summed into heavy atoms:
elementType: Cl F F F O C C C C C C C C C C C C C C
charge: -0.065552 -0.166984 -0.166651 -0.168443 -0.107662 -0.102911 0.450990 0.549510 -0.174452 0.315829 -0.124861 -0.380251 -0.072478 -0.122739 0.033827 0.243963 0.034166 0.012228 0.012471
polarizability: 2.02023037e+02 -4.81381237e+00 1.51616217e+02 -8.68317486e+00 1.21697969e+00 1.21316434e+02
1716.lowfreq: -14.2955 -7.3897 -4.1879 0.0016 0.0021 0.0021 5.2390 9.7346 28.9149
frequency: -13.7646 8.4640 28.8991 56.2390 108.7627 114.8474 132.8711 161.4958 193.0261 230.3878 236.5975 284.5777 299.4437 312.0004 325.5901 365.0085 386.1630 397.6981 423.7717 429.2681 452.3918 472.5278 514.4318 550.2857 584.1084 591.4367 609.2884 645.5808 683.1206 697.3422 708.1585 739.8403 766.1150 792.3237 829.3380 864.0228 875.0784 934.5246 945.4150 957.3143 984.5285 985.4468 989.4231 991.3007 993.4032 1007.3386 1014.6674 1037.7779 1055.2729 1107.4646 1122.1503 1142.6099 1172.0321 1188.7865 1189.7638 1214.1363 1254.8209 1282.1407 1301.3833 1309.2113 1359.4278 1380.2218 1393.5266 1426.1724 1436.8313 1457.7278 1478.3876 1575.0638 1602.6019 1603.6457 1619.0769 2978.4695 3135.8632 3138.5409 3150.0182 3156.0748 3163.7979 3176.5687 3176.8703 3180.7710 3579.0966
redmass: 14.8790 7.4159 7.9048 5.1319 11.7344 6.7776 4.9853 6.9469 5.0467 5.5571 7.1183 4.3278 6.5886 1.3103 5.6384 7.7485 9.7801 6.2546 4.4397 4.6596 4.7072 4.6056 10.3413 4.5563 6.2646 5.5541 11.5659 6.5426 7.3123 3.6975 2.9422 3.2672 1.3457 2.2880 2.2185 2.4499 1.8232 1.4437 1.4724 1.3987 4.6008 7.3996 5.8465 1.3488 1.6062 6.3151 6.8303 2.1512 3.6455 1.8399 1.7309 1.4919 1.0786 1.1261 1.8830 1.3107 1.6669 2.7039 1.3425 1.4160 1.6077 5.7690 8.4780 2.1600 3.2157 2.4335 2.5585 6.1738 6.6947 6.5642 6.3416 1.0833 1.0881 1.0858 1.0904 1.0928 1.0954 1.1001 1.0966 1.0931 1.0663
irintensity: 0.0421 0.3069 1.3829 0.1001 0.1688 0.1990 0.5755 1.7866 3.3227 0.2258 2.2288 12.1112 1.8684 135.9492 23.9586 10.2078 16.7415 1.3421 3.0200 1.0451 7.9469 3.5846 1.8872 1.0349 2.2665 20.3912 14.3143 12.6831 13.8884 10.0834 20.5667 26.1082 61.4672 73.8826 7.7371 32.2601 19.7861 16.4876 33.2087 3.2333 150.8863 79.2990 18.4739 1.0127 27.8781 152.0829 52.7099 8.1666 87.0573 12.5438 3.6489 36.8480 1.4417 2.5151 4.9240 64.8503 30.8578 294.1240 4.7203 26.1503 6.4868 1.5663 2.3951 26.8057 27.0265 29.3180 11.3238 12.2890 2.9758 8.1273 3.8761 10.7030 4.1762 1.1155 5.5419 7.3878 8.8790 12.8847 3.5551 6.1508 14.2496
temp: 298.150 k
press: 1.00000 atm
elementType: 17 9 9 9 8 6 6 6 6 6 6 6 6 6 6 6 6 6 6 1 1 1 1 1 1 1 1 1 1
symmnumber: 1
zpe: 533655.1 jmol-1
zpe.correction: 0.203259 hartree
zpe.thermalcorrener: 0.219279 hartree
zpe.thermalcorrenthalpy: 0.220224 hartree
zpe.thermalcorrgfe: 0.157284 hartree
zpe.sumelectzpe: -1372.951449 hartree
zpe.sumelectthermal: -1372.935428 hartree
zpe.sumelectthermalent: -1372.934484 hartree
zpe.sumelectthermalfe: -1372.997424 hartree
dipole: 5.4839 0.1097 -1.4321
dipole: 5.6689
quadrupole: -124.0544 -110.6310 -110.6394
quadrupole: 10.6681 1.1985 2.7508
quadrupole: -8.9461 4.4773 4.4689 10.6681 1.1985 2.7508
hfenergy: -1373.1547075 hartree
pointgroup: C01 [X(C14H10Cl1F3O1)]
dipole: 2.0969184 -0.028529 -0.7592326 debye
polarizability: 198.4768889|-6.5288038|150.5218602|-16.5640929|9.2065022|125.9569384 unknown
InChI: InChI=1S/C14H10ClF3O/c15-12-7-2-1-6-11(12)13(19)9-4-3-5-10(8-9)14(16,17)18/h1-8,13,19H
charge 0 multiplicity 1
29 atoms
Cl 3.318318 -2.582341 0.161188
F  -5.005917 0.367378 -0.166928
F  -4.354445 -0.149632 1.94276
F  -3.71463 1.811483 1.016555
O  0.741819 0.190686 2.428993
C  1.015361 -0.629475 1.238526
C  -0.292982 -0.722822 0.448945
C  2.153789 -0.018392 0.413197
C  -1.470453 -0.112397 0.927069
C  -2.669649 -0.222572 0.182761
C  -0.328391 -1.448198 -0.769475
C  3.234088 -0.764117 -0.107897
C  2.148135 1.379364 0.156791
C  -2.710394 -0.944425 -1.02957
C  -1.52913 -1.558649 -1.5007
C  -3.90822 0.432944 0.72193
C  4.278598 -0.176897 -0.849318
C  3.177468 1.993132 -0.584251
C  4.246577 1.214437 -1.087805
H  1.313593 -1.653055 1.545924
H  -1.435804 0.439955 1.869487
H  0.58367 -1.923034 -1.14868
H  1.317112 1.970172 0.55694
H  -3.644382 -1.021645 -1.593432
H  -1.547031 -2.120938 -2.439811
H  1.566274 0.250459 2.97356
H  5.096699 -0.794601 -1.230523
H  3.148602 3.071707 -0.770515
H  5.052823 1.681376 -1.663117
