program: Gaussian 09
title: 000264727
version: EM64L-G09RevD.01
frameworkgroup: C1[X(C10H10N4O2S)]
method: RPBEPBE
basis: SDD
operation: Freq
keyword: #p
keyword: freq=noraman
keyword: PBEPBE/SDD
title: #p freq=noraman PBEPBE/SDD
converged: YES YES NO NO
title: Mulliken charges:
elementType: S O O N N N N C C C C C C C C C C H H H H H H H H H H
charge: 0.299428 -0.425187 -0.427551 -0.168560 -0.051993 -0.088959 -0.011396 0.187366 0.131385 -0.218993 -0.292748 -0.342723 -0.368478 -0.698049 0.055954 -0.014694 -0.391131 0.275164 0.233319 0.233099 0.253598 0.313115 0.314556 0.385611 0.225385 0.247023 0.345461
chargesum: 0.00000
title: Mulliken charges with hydrogens summed into heavy atoms:
elementType: S O O N N N N C C C C C C C C C C
charge: 0.299428 -0.039577 -0.082090 -0.168560 -0.051993 -0.088959 -0.011396 0.187366 0.131385 0.056171 0.173669 -0.342723 -0.114880 -0.070378 0.055954 -0.014694 0.081277
polarizability: 2.90654319e+02 -1.68408050e+00 1.49764314e+02 7.59002180e+00 1.60054853e+00 8.07482291e+01
1716.lowfreq: -8.5861 -5.0121 -1.2131 0.0009 0.0016 0.0016 11.5169 16.2076 45.2596
frequency: 11.4731 16.0848 45.2546 52.7545 66.6827 91.0508 114.7103 131.7299 152.6753 181.2058 204.1397 242.7359 255.0122 282.7745 293.9175 339.4728 393.5887 414.1100 440.4401 500.6955 518.9072 535.6304 559.7386 599.4385 628.1023 640.2039 662.7389 669.5716 734.9712 759.8076 791.3494 821.4835 835.4206 874.0343 907.3790 923.7633 929.3674 974.2241 988.1192 1016.1940 1090.9190 1124.3488 1137.6430 1164.9962 1171.2799 1175.7863 1187.4072 1235.5806 1245.0156 1285.4640 1294.3451 1298.6854 1321.5153 1347.7295 1370.1584 1371.6653 1391.7985 1400.7528 1416.7751 1442.8306 1452.8630 1475.7890 1526.1214 1545.1307 2272.6545 2959.3040 2982.7955 3039.0502 3066.5420 3104.8226 3108.1423 3177.3806 3233.9731 3419.1762 3561.3320
redmass: 6.1470 4.7292 3.9024 5.4199 5.4945 5.6342 3.9346 4.2980 9.0318 6.0381 3.6225 3.5911 3.6983 4.8829 2.4893 1.8160 6.9903 6.5896 10.2739 5.0161 7.5257 4.3776 6.7489 1.3296 5.7399 4.0046 7.7408 8.4946 6.6228 4.2771 5.6687 10.9485 1.5861 1.5177 7.9549 1.4314 4.2592 1.7806 3.0004 2.1880 6.3567 5.1946 1.0743 2.1068 1.2802 2.3248 2.4703 1.7538 1.4567 8.4629 1.2011 4.0356 2.2227 1.9206 1.4927 1.8179 1.6276 1.3413 1.1042 2.2565 1.0777 1.2632 8.8974 8.0106 11.7064 1.0685 1.0677 1.0570 1.0920 1.1060 1.0982 1.0925 1.0987 1.0660 1.0665
irintensity: 0.5154 1.8430 1.0410 3.7475 4.7170 1.9500 5.4528 3.5258 0.9060 5.9559 8.2593 23.3353 2.3488 11.0648 36.5705 142.2081 14.0194 4.0101 1.0008 5.4833 12.7353 1.4960 7.0950 276.4007 11.6015 44.6778 13.9223 7.1374 96.9656 21.0743 12.0233 31.2845 13.6719 2.4497 70.0724 10.5529 125.9090 0.3900 138.7256 26.4768 29.8819 29.6846 0.9351 240.1976 7.5950 50.2908 4.7343 40.7805 36.1928 91.7923 8.3540 49.9108 1.2623 32.2603 103.5553 1.5446 70.9104 96.3753 9.7809 32.3271 6.5826 11.0514 246.7848 73.9495 0.4489 48.4232 65.1811 1.9843 11.0785 0.5280 17.9865 11.9872 0.0291 70.8097 11.0064
temp: 298.150 k
press: 1.00000 atm
elementType: 16 8 8 7 7 7 7 6 6 6 6 6 6 6 6 6 6 1 1 1 1 1 1 1 1 1 1
symmnumber: 1
zpe: 508417.3 jmol-1
zpe.correction: 0.193646 hartree
zpe.thermalcorrener: 0.210343 hartree
zpe.thermalcorrenthalpy: 0.211287 hartree
zpe.thermalcorrgfe: 0.145199 hartree
zpe.sumelectzpe: -1153.255178 hartree
zpe.sumelectthermal: -1153.238481 hartree
zpe.sumelectthermalent: -1153.237537 hartree
zpe.sumelectthermalfe: -1153.303626 hartree
dipole: 2.6049 -0.4923 1.0427
dipole: 2.8487
quadrupole: -113.3153 -102.2907 -105.7838
quadrupole: -4.6059 14.7662 -2.0235
quadrupole: -6.1854 4.8392 1.3462 -4.6059 14.7662 -2.0235
hfenergy: -1153.4488244 hartree
pointgroup: C01 [X(C10H10N4O2S1)]
dipole: -1.0219276 0.1675722 0.4285705 debye
polarizability: 290.544314|-1.3189658|149.6810364|-9.0270109|2.9308389|80.9415119 unknown
InChI: InChI=1S/C10H10N4O2S/c15-3-1-2-4-17-10-8-9(11-5-12-10)14(7-16)6-13-8/h5-6,15-16H,3-4,7H2
charge 0 multiplicity 1
27 atoms
S  1.406799 0.750526 -0.125509
O  -5.398562 -0.554773 -0.660825
O  7.222851 0.41368 0.762765
N  -3.636399 0.845056 0.212716
N  -1.689316 2.060353 0.062761
N  -2.709655 -1.440125 0.154286
N  -0.267187 -1.438317 0.001042
C  -2.59888 -0.08057 0.156725
C  -1.395071 0.683838 0.067743
C  -3.032836 2.111535 0.142894
C  -5.062768 0.440553 0.322112
C  -0.195905 -0.073013 -0.009842
C  -1.490694 -2.04968 0.076986
C  2.533404 -0.80848 -0.197926
C  3.924974 -0.401043 -0.323501
C  5.110359 -0.069696 -0.426561
C  6.520938 0.34145 -0.532691
H  -3.615942 3.03031 0.157736
H  -5.229544 0.071195 1.354356
H  -5.693108 1.320947 0.126334
H  -1.485585 -3.142607 0.070116
H  2.340511 -1.382385 0.722404
H  2.185689 -1.408514 -1.053865
H  -4.826625 -1.358168 -0.494529
H  6.580853 1.313766 -1.066635
H  7.0941 -0.401807 -1.112395
H  6.6893 0.97447 1.382103
