program: Gaussian 09
title: 000264766
version: EM64L-G09RevD.01
frameworkgroup: C1[X(C14H11ClN6O4)]
method: RPBEPBE
basis: SDD
operation: Freq
keyword: #p
keyword: freq=noraman
keyword: PBEPBE/SDD
title: #p freq=noraman PBEPBE/SDD
converged: YES YES NO NO
title: Mulliken charges:
elementType: Cl O O O O N N N N N N C C C C C C C C C C C C C C H H H H H H H H H H H
charge: 0.028134 -0.179682 -0.180208 -0.193851 -0.186195 -0.157713 -0.026522 -0.012440 0.011783 0.024892 0.063782 -0.391768 -0.454817 -0.435590 0.384134 0.150446 0.225350 -0.215238 -0.338189 0.130264 -0.505041 -0.413333 0.428367 -0.303895 -0.348989 0.223794 0.215936 0.240699 0.262796 0.254479 0.270296 0.274452 0.266964 0.333575 0.295005 0.258322
chargesum: 0.00000
title: Mulliken charges with hydrogens summed into heavy atoms:
elementType: Cl O O O O N N N N N N C C C C C C C C C C C C C C
charge: 0.028134 -0.179682 -0.180208 -0.193851 -0.186195 -0.157713 -0.026522 -0.012440 0.011783 0.024892 0.063782 0.047961 0.048677 0.089186 0.384134 0.150446 0.225350 0.059214 -0.071225 0.130264 -0.171466 -0.118328 0.428367 -0.303895 -0.090666
polarizability: 2.88361938e+02 -2.72754259e+01 2.34472834e+02 9.14300596e+00 1.64625469e+01 1.47210908e+02
1716.lowfreq: -2.4238 -0.3994 -0.0002 0.0006 0.0011 6.4454 14.3167 17.2983 18.3087
frequency: 14.2963 17.2933 18.2293 37.4231 48.0079 60.3411 79.9407 89.5085 130.7803 151.0949 154.8274 157.6093 178.5117 214.8570 235.9685 256.8532 276.4970 286.4249 290.5170 331.9605 361.4439 369.0796 380.6210 431.8142 453.3196 482.0372 508.1106 529.1771 545.5331 560.7557 585.0001 625.5730 635.0371 644.2345 647.0882 657.9431 672.5095 684.3761 700.0594 724.3552 756.1826 765.5104 789.0470 792.9186 804.0901 842.3441 853.5506 868.2252 889.7981 903.9233 918.4604 959.1256 973.6511 999.2266 1044.9985 1056.2186 1077.3785 1099.2179 1109.7988 1121.4873 1148.2029 1158.8108 1186.0510 1190.2363 1209.0686 1215.8271 1218.5395 1249.2393 1270.7107 1283.7059 1286.4206 1302.6310 1305.3857 1335.7248 1357.5287 1359.7592 1366.7737 1373.3980 1384.0904 1397.2296 1400.7098 1419.1029 1429.9866 1443.0167 1465.3888 1472.6034 1477.8530 1506.4528 1564.3062 1587.3316 1611.0454 2978.0943 2995.9585 3015.5213 3028.8285 3050.8372 3081.9758 3172.2645 3188.6565 3190.4759 3191.3909 3226.9931
redmass: 11.1310 12.9534 7.8001 10.4532 11.1727 10.0575 8.3945 9.2446 3.3484 4.3822 6.2399 5.6180 10.6439 4.3452 5.1749 4.5251 4.4080 5.4572 3.8307 8.9413 6.8346 6.7303 12.2390 3.6950 3.9436 4.4069 6.9246 4.2729 6.8798 5.7473 5.1692 7.2109 5.7347 4.3922 6.0430 6.1360 6.5090 3.8955 3.3411 6.8579 7.2178 4.6945 4.1021 2.5197 7.5864 1.5302 1.5261 3.9593 4.1916 3.2100 1.4405 1.4636 2.7558 1.4185 2.3804 2.2575 2.6030 4.7716 3.2408 3.2762 1.7815 2.3327 2.1510 3.0229 5.4518 3.0714 2.4429 1.7330 1.4551 1.3825 5.6483 1.4913 3.6536 1.9043 2.6351 3.3107 3.1955 1.4260 4.9259 3.9771 1.9477 4.3472 1.2164 2.3968 1.1920 1.5314 1.9500 8.3530 9.9169 8.5325 6.8441 1.0604 1.0620 1.0653 1.0930 1.1003 1.1053 1.0884 1.0937 1.0951 1.0932 1.0985
irintensity: 0.2931 0.6069 0.4813 0.2461 0.3263 1.8408 0.3479 0.8983 0.1892 1.2771 3.2456 1.4366 2.9142 1.2647 1.3441 1.6375 2.5740 2.1310 1.8061 1.3909 1.5294 5.5205 4.6904 0.4453 1.3838 4.6539 2.7485 3.4456 14.2844 4.8811 1.4317 7.4035 3.2188 12.9602 7.6730 13.9227 23.5932 15.2032 5.5953 2.6318 12.5501 15.5570 12.6403 12.8244 28.4292 14.4683 32.3197 12.5609 58.1012 38.1803 12.5215 26.0508 2.3550 1.0251 8.2952 28.2242 10.2871 37.4689 10.8869 2.3627 21.8198 46.4952 18.3736 93.0065 172.0205 176.3224 90.8751 30.4560 5.3052 5.7529 65.1949 3.9115 66.7369 15.4998 52.0923 94.8312 3.2783 4.0985 40.8373 32.5122 56.8468 63.0616 62.5638 65.2865 21.5956 49.3784 21.2335 136.4454 75.8179 10.7193 66.2600 19.0053 7.2422 19.8718 14.4287 24.8462 8.2704 4.3072 5.9728 16.2634 6.6085 0.1061
temp: 298.150 k
press: 1.00000 atm
elementType: 17 8 8 8 8 7 7 7 7 7 7 6 6 6 6 6 6 6 6 6 6 6 6 6 6 1 1 1 1 1 1 1 1 1 1 1
symmnumber: 1
zpe: 651679.4 jmol-1
zpe.correction: 0.248212 hartree
zpe.thermalcorrener: 0.269489 hartree
zpe.thermalcorrenthalpy: 0.270433 hartree
zpe.thermalcorrgfe: 0.193290 hartree
zpe.sumelectzpe: -1627.600873 hartree
zpe.sumelectthermal: -1627.579596 hartree
zpe.sumelectthermalent: -1627.578652 hartree
zpe.sumelectthermalfe: -1627.655795 hartree
dipole: -0.8668 7.8003 -2.8411
dipole: 8.3467
quadrupole: -210.7726 -146.8069 -152.1855
quadrupole: -1.1927 -4.5597 -5.7791
quadrupole: -40.8509 23.1148 17.7362 -1.1927 -4.5597 -5.7791
hfenergy: -1627.8490849 hartree
pointgroup: C01 [X(C14H11Cl1N6O4)]
dipole: 0.2068234 2.9883323 1.3456309 debye
polarizability: 285.7804051|28.3066487|237.9315375|16.6066229|-8.6248124|146.3337381 unknown
InChI: InChI=1S/C14H11ClN6O4/c15-13-12-14(17-7-16-13)19(8-18-12)5-1-2-9-3-4-10(20(22)23)6-11(9)21(24)25/h3-4,6-8H,1-2,5H2
charge 0 multiplicity 1
36 atoms
Cl -5.911956 -1.176288 -2.18677
O  2.226207 -3.089113 0.681439
O  0.276144 -2.038352 0.152788
O  6.5656 1.184329 -0.812405
O  6.371513 -1.089263 -0.731093
N  -2.685746 1.658197 0.483532
N  -4.067678 1.526544 -1.357956
N  -3.052524 -0.600812 1.424515
N  1.55114 -2.041656 0.351936
N  5.885927 0.100918 -0.642501
N  -4.616447 -1.915498 0.082575
C  -0.248522 2.128284 0.954323
C  -1.7104 2.183875 1.458617
C  0.193547 0.686319 0.625334
C  1.667076 0.511066 0.286464
C  -3.252165 0.38205 0.510881
C  2.303157 -0.764561 0.171204
C  -3.210974 2.290152 -0.656104
C  2.506877 1.641024 0.083272
C  -4.11073 0.317987 -0.642412
C  3.673849 -0.916534 -0.116792
C  3.873752 1.527275 -0.226288
C  4.441163 0.240187 -0.321573
C  -4.787258 -0.913357 -0.794615
C  -3.76623 -1.728236 1.146794
H  0.385637 2.559233 1.754072
H  -0.144668 2.783411 0.066969
H  -1.989053 3.224029 1.704867
H  -1.821957 1.572115 2.37136
H  -0.076105 0.018342 1.466285
H  -0.403878 0.29492 -0.219538
H  -2.943238 3.311801 -0.920769
H  2.077734 2.641746 0.16877
H  4.12523 -1.909854 -0.178467
H  4.502347 2.406549 -0.389841
H  -3.654871 -2.571525 1.831829
