program: Gaussian 09
title: 000264726
version: EM64L-G09RevD.01
frameworkgroup: C1[X(C12H17N5OS)]
method: RPBEPBE
basis: SDD
operation: Freq
keyword: #p
keyword: freq=noraman
keyword: PBEPBE/SDD
title: #p freq=noraman PBEPBE/SDD
converged: YES YES NO NO
title: Mulliken charges:
elementType: S O N N N N N C C C C C C C C C C C C H H H H H H H H H H H H H H H H H
charge: 0.267239 -0.244360 -0.104333 -0.172669 -0.051281 -0.023313 0.000394 -0.335642 -0.345849 -0.352282 -0.320886 -0.312402 0.131597 -0.201903 0.102439 -0.350110 -0.386580 -0.573446 -0.665006 0.209716 0.228788 0.212496 0.202406 0.234761 0.250234 0.221890 0.197904 0.194350 0.219147 0.281256 0.246967 0.277596 0.276702 0.229683 0.229944 0.224555
chargesum: 0.00000
title: Mulliken charges with hydrogens summed into heavy atoms:
elementType: S O N N N N N C C C C C C C C C C C C
charge: 0.267239 -0.244360 -0.104333 -0.172669 -0.051281 -0.023313 0.000394 0.102861 0.069052 0.132714 0.098908 0.101094 0.131597 0.079353 0.102439 -0.350110 -0.139614 -0.019148 0.019177
polarizability: 2.82418950e+02 5.84161473e+00 1.65270492e+02 -2.71796702e+01 1.21588446e+01 1.26687628e+02
1716.lowfreq: -6.9146 -5.7223 -0.0022 -0.0018 -0.0016 6.5782 14.2439 29.1149 40.5770
frequency: 13.6878 29.0601 40.5280 45.3224 71.7513 93.6692 101.6260 143.1238 186.7700 196.6302 218.4419 236.9021 240.9426 249.9985 286.1091 298.3318 313.4746 325.1970 394.2010 431.3327 443.2433 466.0157 535.2066 545.4663 584.5814 603.0442 624.9211 628.1664 646.3325 655.0432 743.1808 768.1230 774.9090 791.7994 806.0979 814.6965 839.5368 841.4492 893.6365 916.8691 920.1781 995.3242 995.7428 1008.4861 1025.0985 1042.5052 1054.2404 1065.2388 1080.4801 1096.2691 1102.8272 1120.6385 1136.7852 1162.9944 1184.8089 1191.6485 1194.2040 1230.6351 1235.2815 1265.7981 1275.1203 1277.9200 1288.5947 1295.8799 1301.3213 1315.1604 1336.5279 1350.9000 1360.3137 1370.8810 1371.8960 1392.1084 1400.1399 1403.5742 1442.6011 1444.6046 1446.9581 1451.3830 1454.0594 1464.3647 1472.6246 1483.2808 1484.3599 1517.2118 1542.6598 2887.0092 2895.2661 2919.6963 2957.9522 2962.9684 2987.1159 3025.0121 3029.6033 3043.6187 3049.6657 3081.5432 3084.8146 3085.9497 3090.2464 3128.7953 3168.9196 3246.0528
redmass: 5.2235 4.5433 3.1002 4.3243 2.1332 4.2078 6.6558 4.4922 6.3676 5.0636 4.7709 1.6881 1.4216 3.0326 3.7789 4.5740 3.9234 2.4052 1.8859 9.8253 6.2912 2.8144 4.3952 5.7935 3.4265 3.4625 5.0360 6.3159 4.5010 6.2852 5.5588 3.9577 1.1197 6.5008 3.8285 10.8655 1.5711 1.6034 3.1198 4.1719 1.4355 1.8864 2.4069 2.0157 2.1680 1.2135 1.9981 2.4132 3.8432 2.8075 3.6183 3.3611 2.9952 3.3552 2.8800 1.9143 1.0863 1.2314 1.3666 1.6695 1.3296 1.4522 7.4444 1.3408 4.4290 1.7737 1.2648 1.3657 1.9637 2.4688 1.3324 1.6054 1.2070 1.4555 2.2302 1.2051 1.0931 1.1239 1.1099 1.1153 1.0391 1.0493 1.1397 9.2614 9.4711 1.0690 1.0691 1.0677 1.0667 1.0666 1.0357 1.0915 1.0932 1.0912 1.0600 1.0970 1.1011 1.0964 1.0978 1.1079 1.0921 1.0985
irintensity: 0.0540 0.6834 0.0659 0.7310 3.0122 3.9375 0.7408 4.6734 1.6491 0.8840 1.1658 1.2078 1.1296 1.0843 1.3995 5.7023 8.9346 3.3468 0.2384 10.7520 4.2402 1.6312 0.6715 17.0869 2.2694 9.9429 0.7214 6.4734 16.4109 0.8787 27.9046 9.1614 9.6070 3.8575 15.2920 28.6450 14.2247 0.2009 68.7848 31.6393 11.1551 47.0733 17.2066 11.4372 13.7052 0.3444 22.7255 0.9712 62.1080 1.5140 15.5499 2.9273 141.3722 55.6178 7.9802 132.7480 1.8939 0.5480 18.4918 30.2852 4.4113 11.6908 68.1102 6.7036 65.2200 62.3103 4.7358 1.4901 41.9613 6.1397 1.3967 41.3127 20.5591 48.6939 35.0152 14.7836 6.7538 1.8281 18.7146 7.8823 15.0848 10.2795 20.3964 202.4597 123.8491 64.0346 64.2641 44.6524 42.0830 78.2911 38.2714 32.6929 35.5208 31.8221 4.2837 26.4586 14.9526 38.6889 28.9336 22.3267 15.8649 0.5578
temp: 298.150 k
press: 1.00000 atm
elementType: 16 8 7 7 7 7 7 6 6 6 6 6 6 6 6 6 6 6 6 1 1 1 1 1 1 1 1 1 1 1 1 1 1 1 1 1
symmnumber: 1
zpe: 756861.0 jmol-1
zpe.correction: 0.288273 hartree
zpe.thermalcorrener: 0.306200 hartree
zpe.thermalcorrenthalpy: 0.307144 hartree
zpe.thermalcorrgfe: 0.239456 hartree
zpe.sumelectzpe: -1213.057153 hartree
zpe.sumelectthermal: -1213.039226 hartree
zpe.sumelectthermalent: -1213.038282 hartree
zpe.sumelectthermalfe: -1213.105970 hartree
dipole: 1.3469 1.1852 -0.9267
dipole: 2.0193
quadrupole: -110.5076 -125.9974 -117.2817
quadrupole: -2.3884 -16.1045 -1.9957
quadrupole: 7.4213 -8.0685 0.6472 -2.3884 -16.1045 -1.9957
hfenergy: -1213.3454259 hartree
pointgroup: C01 [X(C12H17N5O1S1)]
dipole: -0.5137017 0.5632144 0.2236798 debye
polarizability: 281.9064023|-16.7635945|157.3805397|-23.9254632|-19.6196113|135.0901272 unknown
InChI: InChI=1S/C12H17N5OS/c1-2-19-12-10-11(13-7-14-12)17(8-15-10)9-16-3-5-18-6-4-16/h7-8H,2-6,9H2,1H3
charge 0 multiplicity 1
36 atoms
S  4.129176 -1.21104 0.402183
O  -5.309923 -0.764733 -1.202074
N  -3.013983 0.126615 0.315527
N  -0.661593 0.330729 0.854871
N  0.918448 -1.261191 1.36359
N  0.735449 1.871413 -0.497272
N  3.049551 1.080544 -0.69099
C  -2.899992 -0.173877 -1.137807
C  -4.383399 0.589213 0.661936
C  -1.959724 1.027295 0.804742
C  -3.949568 -1.225064 -1.529934
C  -5.404165 -0.481423 0.238353
C  0.525931 0.753948 0.250992
C  -0.364537 -0.87922 1.502606
C  1.497601 -0.245524 0.578861
C  2.80412 -0.031198 0.064515
C  2.025394 1.959966 -0.933289
C  5.566142 -0.386193 -0.53449
C  6.806653 -1.278466 -0.398181
H  -3.048893 0.747838 -1.751312
H  -1.887928 -0.565689 -1.347626
H  -4.447556 0.748824 1.755512
H  -4.636695 1.551672 0.153684
H  -2.238309 1.365451 1.820129
H  -1.792111 1.92635 0.167781
H  -3.950724 -1.396667 -2.618452
H  -3.738089 -2.179181 -1.00125
H  -5.226639 -1.412891 0.818084
H  -6.436147 -0.13136 0.404182
H  -1.128293 -1.438413 2.037096
H  2.276363 2.831264 -1.54472
H  5.243513 -0.262102 -1.579463
H  5.710448 0.612856 -0.095426
H  7.105106 -1.404406 0.65774
H  6.637435 -2.280022 -0.831866
H  7.653339 -0.814218 -0.936534
