program: Gaussian 09
title: 000264723
version: EM64L-G09RevD.01
frameworkgroup: C1[X(C8H10N4OS)]
method: RPBEPBE
basis: SDD
operation: Freq
keyword: #p
keyword: freq=noraman
keyword: PBEPBE/SDD
title: #p freq=noraman PBEPBE/SDD
converged: YES YES NO NO
title: Mulliken charges:
elementType: S O N N N N C C C C C C C C H H H H H H H H H H
charge: 0.278147 -0.427053 -0.170573 -0.052235 -0.095164 -0.002417 0.189094 0.130393 -0.345485 -0.222119 -0.291982 -0.573228 -0.371994 -0.663922 0.273594 0.231645 0.231807 0.278381 0.278976 0.250814 0.231018 0.230478 0.226283 0.385544
chargesum: 0.00000
title: Mulliken charges with hydrogens summed into heavy atoms:
elementType: S O N N N N C C C C C C C C
charge: 0.278147 -0.041509 -0.170573 -0.052235 -0.095164 -0.002417 0.189094 0.130393 -0.345485 0.051474 0.171470 -0.015871 -0.121180 0.023856
polarizability: 2.15921842e+02 6.81402549e+00 1.37823925e+02 3.01672105e+00 -1.61766647e+00 6.78505342e+01
1716.lowfreq: -4.5168 -0.0016 -0.0013 0.0014 4.5865 4.9810 33.5680 60.6615 71.5678
frequency: 33.5397 60.6596 71.5551 88.4848 106.1145 150.5917 195.2105 212.7544 241.3540 252.9139 280.1489 289.9134 414.8881 438.1181 500.6050 535.4338 561.9944 608.8248 623.4601 629.5100 641.7196 668.1269 735.4001 775.3468 790.9734 822.3486 832.9149 908.2788 923.4022 989.7645 995.1498 1017.1388 1043.9062 1064.8826 1094.4528 1125.3722 1165.8567 1187.5988 1232.4096 1236.3564 1277.1098 1285.8777 1298.7964 1320.5849 1347.7323 1372.4243 1391.7220 1400.2035 1403.5936 1442.5885 1446.0762 1473.0440 1476.1542 1483.0110 1527.1603 1544.3071 2979.1704 2987.8977 3050.5195 3082.6933 3085.7870 3105.2534 3129.9899 3174.4561 3233.2178 3401.7030
redmass: 3.4505 4.3168 2.6202 4.8501 3.7583 9.6015 3.7388 5.7583 1.1740 3.4095 5.3451 4.0920 6.6850 10.7605 5.1493 4.3369 7.1307 1.4676 4.7332 4.8810 3.3740 7.8453 6.4810 1.1206 5.2112 10.8810 1.6218 7.9510 1.4320 3.0311 1.7970 2.1531 1.2154 2.4731 5.0907 5.1955 2.0591 2.4186 1.2282 1.8749 1.3658 6.2508 3.9817 2.2263 1.9185 2.6435 1.6469 1.2061 1.3209 2.2470 1.0917 1.0390 1.2614 1.0484 9.0217 7.8648 1.0678 1.0357 1.0598 1.0971 1.1012 1.0980 1.1080 1.0924 1.0986 1.0660
irintensity: 1.0128 2.7929 3.3254 0.3313 6.8062 0.4629 6.4633 1.4478 0.4595 3.0825 1.5502 0.8572 7.7927 4.0776 5.3110 2.0165 4.9671 221.9136 1.1774 19.9971 60.8621 2.6812 95.4248 10.2968 11.3932 29.3877 13.3856 64.2688 11.0465 134.3653 20.7655 24.5879 0.3920 0.7003 29.4762 25.9605 221.0933 5.9452 0.5594 18.6913 9.4790 89.3123 51.4984 1.7456 26.1857 17.0715 65.3807 18.0309 109.0010 26.0126 6.8937 15.5603 6.8793 9.7931 229.3620 72.1591 68.0917 34.2655 4.0813 24.7768 14.7347 19.3757 21.3063 12.9708 0.0083 81.8175
temp: 298.150 k
press: 1.00000 atm
elementType: 16 8 7 7 7 7 6 6 6 6 6 6 6 6 1 1 1 1 1 1 1 1 1 1
symmnumber: 1
zpe: 474131.2 jmol-1
zpe.correction: 0.180587 hartree
zpe.thermalcorrener: 0.193786 hartree
zpe.thermalcorrenthalpy: 0.194730 hartree
zpe.thermalcorrgfe: 0.139421 hartree
zpe.sumelectzpe: -1002.097338 hartree
zpe.sumelectthermal: -1002.084139 hartree
zpe.sumelectthermalent: -1002.083195 hartree
zpe.sumelectthermalfe: -1002.138504 hartree
dipole: -0.0211 0.4956 -1.4765
dipole: 1.5576
quadrupole: -76.9627 -90.4371 -91.6480
quadrupole: 11.7507 7.3575 -0.1455
quadrupole: 9.3866 -4.0878 -5.2987 11.7507 7.3575 -0.1455
hfenergy: -1002.2779254 hartree
pointgroup: C01 [X(C8H10N4O1S1)]
dipole: 0.020774 -0.2861605 0.5414924 debye
dipolederiv: -0.8986802 -0.1632224 0.0366993 -0.4359845 -0.0597631 0.0294815 0.0081144 0.0120578 -0.0642282 -0.7390025 -0.1703926 0.1151413 -0.2977927 -0.549933 -0.1495189 -0.066769 -0.1546229 -0.5708344 -1.0170259 -0.058414 0.0261736 -0.3228575 -0.5256238 -0.0705364 -0.0015323 -0.0668034 -0.2011393 -0.6359976 -0.0135611 0.0174531 0.033808 -0.3664698 -0.0244021 0.0260094 -0.0073873 -0.2372303 -0.8454274 -0.0245728 0.0288899 -0.0956997 -0.5144677 -0.0313201 -0.0254929 -0.0260101 -0.2023237 -0.7553477 -0.1628457 0.0144889 -0.689634 -0.8438557 -0.0298827 -0.0376714 -0.0694557 -0.1632092 0.7828785 -0.2958846 -0.0781881 0.1400903 0.2029987 0.0127548 0.0298299 0.0492548 0.1102708 -0.8305274 -0.1625584 0.0425177 -0.4170735 0.128012 0.0279531 0.0278811 0.0045222 0.0690286 1.5631836 0.3800043 -0.0579438 0.9029821 0.5543757 0.0011587 -0.0073797 0.0321966 0.0116541 0.3847497 0.1828393 -0.0055046 0.4934387 0.4520494 0.0277919 0.0155964 0.0250156 -0.0452077 1.1614124 0.2025914 -0.033366 0.431287 0.5653972 0.1357625 0.0304752 0.1080828 0.667128 0.5409996 -0.1346534 -0.0442775 -0.291057 0.0875314 0.0140472 -0.0637771 0.0045382 0.1377884 0.7816111 0.1245177 -0.0415379 0.1574309 0.5584732 0.0543287 -0.0384895 0.0675711 -0.0342408 -0.1436822 -0.0456573 0.0100767 0.160793 0.0452457 -0.0132438 0.0349016 0.0010183 0.0667709 0.0279552 0.0610597 0.0144748 0.0299922 0.0785502 -0.0126005 0.0125375 -0.0116491 0.1749113 -0.0264825 -0.0218418 -0.0321334 -0.1249378 0.0091898 0.0697602 0.045341 0.0235585 -0.1694568 -0.0097567 0.0465881 0.0074966 0.1097648 -0.0481023 -0.0306576 -0.0073171 0.0116677 0.0819539 -0.0310942 -0.0036677 0.0305676 0.0702607 -0.0296988 0.0771276 0.0446159 0.0722008 -0.0083407 -0.0405432 -0.0074714 -0.0301983 0.0670728 0.0063137 -0.0842907 -0.0264629 -0.0688251 -0.0343925 0.0684452 0.0078806 0.0034459 -0.0116718 -0.0683949 -0.0225523 0.002564 -0.0263863 0.1301619 0.1157178 0.0088395 -0.012635 -0.0808109 -0.0042961 0.1232787 0.026727 0.1148966 -0.0363316 0.1081427 -0.0074183 -0.0125866 -0.0856585 0.0460997 -0.0925158 -0.072155 -0.096102 -0.0805796 -0.1313025 0.0925965 0.028983 0.117146 -0.0112184 -0.0243911 0.0324167 -0.0226695 0.1180213 0.5697743 0.1652444 -0.0280374 0.1391116 0.2875868 0.0124672 0.0100369 0.0233303 0.2798256 unknown
polarizability: 216.0214282|-1.7982163|136.0837984|-8.3798411|9.4257669|69.4910744 unknown
InChI: InChI=1S/C8H10N4OS/c1-2-14-8-6-7(9-3-10-8)12(5-13)4-11-6/h3-4,13H,2,5H2,1H3
charge 0 multiplicity 1
24 atoms
S  2.642262 1.083098 0.02614
O  -3.976729 -0.883489 -0.726635
N  -2.381267 0.599143 0.313147
N  -0.576179 2.024176 0.338182
N  -1.215712 -1.549199 -0.015668
N  1.213594 -1.269207 -0.138659
C  -1.249838 -0.19594 0.156456
C  -0.135099 0.696553 0.176887
C  1.139912 0.088031 0.020464
C  -1.917253 1.92168 0.407953
C  -3.754504 0.032192 0.360534
C  3.955834 -0.271934 -0.228703
C  0.062562 -2.01042 -0.153266
C  5.337406 0.394481 -0.253291
H  -2.595715 2.763878 0.529522
H  -3.881082 -0.462394 1.345267
H  -4.478252 0.853989 0.251978
H  3.844363 -0.991373 0.596782
H  3.713378 -0.784783 -1.171928
H  0.18387 -3.087454 -0.295904
H  5.424058 1.123865 -1.078031
H  5.556122 0.916141 0.695295
H  6.113638 -0.378487 -0.401725
H  -3.30417 -1.620649 -0.648394
