program: Gaussian 09
title: 000264722
version: EM64L-G09RevD.01
frameworkgroup: C1[X(C9H12N4OS)]
method: RPBEPBE
basis: SDD
operation: Freq
keyword: #p
keyword: freq=noraman
keyword: PBEPBE/SDD
title: #p freq=noraman PBEPBE/SDD
converged: YES YES NO NO
title: Mulliken charges:
elementType: S O N N N N C C C C C C C C C H H H H H H H H H H H H
charge: 0.278566 -0.427231 -0.170345 -0.052395 -0.095588 -0.000241 0.188236 0.125330 -0.338359 -0.605678 -0.348940 -0.222575 -0.292327 -0.671899 -0.372656 0.274475 0.274007 0.216999 0.216392 0.273605 0.231577 0.231709 0.213744 0.224003 0.213320 0.250780 0.385492
chargesum: 0.00000
title: Mulliken charges with hydrogens summed into heavy atoms:
elementType: S O N N N N C C C C C C C C C
charge: 0.278566 -0.041739 -0.170345 -0.052395 -0.095588 -0.000241 0.188236 0.125330 -0.338359 -0.057196 0.084450 0.051030 0.170959 -0.020832 -0.121876
polarizability: 2.36475133e+02 5.39871784e+00 1.46381965e+02 2.54175265e+00 -1.99590757e+00 7.67648493e+01
1716.lowfreq: -12.8933 -2.3938 -0.0010 0.0017 0.0019 6.1045 25.4993 41.7195 58.9267
frequency: 25.4672 41.2316 58.9125 66.7732 90.4646 114.7457 148.4203 171.3177 202.9401 227.9631 241.4552 254.5724 282.5133 343.8975 412.8393 435.5659 501.4559 535.3771 563.9833 611.3253 629.7638 642.2224 668.1495 692.3297 735.9837 742.7490 790.7834 822.2773 832.9248 854.6910 901.5300 910.1605 923.2636 988.9856 1016.6058 1046.1925 1059.8986 1087.6120 1109.4182 1125.7481 1166.4027 1188.1920 1214.2667 1235.7021 1253.6961 1284.6234 1285.3367 1298.9042 1320.2621 1336.4682 1347.7470 1372.4666 1390.8752 1391.2795 1403.6950 1440.9212 1442.5349 1474.9342 1475.8217 1478.2124 1485.8599 1527.0246 1543.8451 2978.9701 2979.7401 2990.2817 3038.6804 3041.9129 3078.2896 3081.6639 3104.9109 3119.9164 3174.0834 3233.2382 3399.3106
redmass: 4.3087 1.6259 6.4374 4.8379 3.7912 3.3276 9.1317 4.8250 3.9829 1.1005 4.2416 3.8648 5.9897 3.9930 7.3066 11.7553 5.1233 4.3843 7.1949 1.5329 4.5218 3.1976 7.7045 5.4234 6.3762 1.0850 5.3129 10.7321 1.6146 1.1856 2.2768 4.7045 1.4324 3.1215 2.1395 2.9005 1.1818 4.7969 2.4353 5.0040 2.1052 2.3740 1.3996 1.8395 1.2589 1.1019 7.8235 4.0671 2.2585 1.4364 1.9092 2.5934 1.2039 1.6593 1.3228 1.1240 2.1120 1.0527 1.2670 1.0417 1.0818 9.0432 7.8432 1.0676 1.0354 1.0599 1.1019 1.0574 1.1014 1.0994 1.0979 1.1083 1.0924 1.0986 1.0661
irintensity: 0.7736 0.3153 2.6442 1.1271 5.6446 1.7524 0.4552 4.6295 1.9663 0.0118 1.9443 6.5793 0.5204 0.7834 8.4404 2.4157 5.2092 2.1499 4.3394 210.5652 24.7960 66.6424 2.8366 10.7720 93.9643 10.9042 12.6265 31.5754 13.3266 0.4506 54.3144 29.5835 11.1293 133.4128 23.2334 2.7738 1.4388 10.5313 38.0000 20.2528 221.4569 9.0451 0.0050 16.9230 6.4531 0.2264 78.0737 51.6975 1.7632 6.9170 27.5775 17.9936 13.0178 65.2983 109.7477 15.2147 16.4272 3.9210 7.9336 13.8290 14.1314 240.3558 70.1744 71.5204 34.4332 19.4414 4.4379 9.1318 48.4330 45.9173 19.6524 22.1865 12.8744 0.0084 83.2228
temp: 298.150 k
press: 1.00000 atm
elementType: 16 8 7 7 7 7 6 6 6 6 6 6 6 6 6 1 1 1 1 1 1 1 1 1 1 1 1
symmnumber: 1
zpe: 547247.2 jmol-1
zpe.correction: 0.208435 hartree
zpe.thermalcorrener: 0.223118 hartree
zpe.thermalcorrenthalpy: 0.224062 hartree
zpe.thermalcorrgfe: 0.164586 hartree
zpe.sumelectzpe: -1041.320297 hartree
zpe.sumelectthermal: -1041.305614 hartree
zpe.sumelectthermalent: -1041.304670 hartree
zpe.sumelectthermalfe: -1041.364146 hartree
dipole: 0.1766 0.4910 -1.4928
dipole: 1.5813
quadrupole: -80.8946 -98.4811 -98.0096
quadrupole: 10.5017 7.8907 -0.4907
quadrupole: 11.5671 -6.0193 -5.5479 10.5017 7.8907 -0.4907
hfenergy: -1041.5287325 hartree
pointgroup: C01 [X(C9H12N4O1S1)]
dipole: 0.0853346 -0.2802705 0.5488462 debye
polarizability: 236.5362531|-2.2970057|145.1054312|-5.9425858|8.7493807|77.9802636 unknown
InChI: InChI=1S/C9H12N4OS/c1-2-3-15-9-7-8(10-4-11-9)13(6-14)5-12-7/h4-5,14H,2-3,6H2,1H3
charge 0 multiplicity 1
27 atoms
S  2.162207 1.199404 0.09207
O  -4.367274 -0.995273 -0.791741
N  -2.846748 0.547638 0.272151
N  -1.091904 2.033331 0.322565
N  -1.602894 -1.562301 -0.013478
N  0.817808 -1.20149 -0.085835
C  -1.685875 -0.209695 0.14655
C  -0.602582 0.720129 0.182965
C  0.695506 0.153643 0.060226
C  3.527376 -0.111386 -0.11022
C  4.894029 0.592548 -0.092262
C  -2.429954 1.885993 0.364467
C  -4.199769 -0.066839 0.294752
C  6.042584 -0.431623 -0.245719
C  -0.306976 -1.981047 -0.119467
H  3.337866 -0.637831 -1.059166
H  3.414259 -0.831084 0.716054
H  4.94592 1.335295 -0.911476
H  5.017584 1.150064 0.856163
H  -3.138927 2.705715 0.463387
H  -4.328847 -0.560982 1.279378
H  -4.949873 0.728168 0.167157
H  5.960741 -0.983731 -1.200279
H  7.023788 0.075807 -0.230572
H  6.029973 -1.171077 0.576297
H  -0.146561 -3.054436 -0.250541
H  -3.671554 -1.708438 -0.694628
