program: Gaussian 09
title: 000264724
version: EM64L-G09RevD.01
frameworkgroup: C1[X(C11H16N4OS)]
method: RPBEPBE
basis: SDD
operation: Freq
keyword: #p
keyword: freq=noraman
keyword: PBEPBE/SDD
title: #p freq=noraman PBEPBE/SDD
converged: YES YES NO NO
title: Mulliken charges:
elementType: S O N N N N C C C C C C C C C C C H H H H H H H H H H H H H H H H
charge: 0.280608 -0.427311 -0.170085 -0.052483 -0.095407 0.000480 -0.340000 -0.342005 -0.351606 -0.661999 0.125314 0.187410 -0.337591 -0.692157 -0.222905 -0.292499 -0.373352 0.191094 0.190465 0.210535 0.209676 0.196814 0.196277 0.279335 0.279645 0.210226 0.210527 0.218135 0.273538 0.231521 0.231605 0.250780 0.385414
chargesum: 0.00000
title: Mulliken charges with hydrogens summed into heavy atoms:
elementType: S O N N N N C C C C C C C C C C C
charge: 0.280608 -0.041896 -0.170085 -0.052483 -0.095407 0.000480 0.041560 0.078206 0.041485 -0.103019 0.125314 0.187410 -0.337591 -0.053269 0.050632 0.170628 -0.122572
polarizability: 2.74544348e+02 3.38795375e+00 1.64089125e+02 2.07260447e+00 -2.09835174e+00 9.40409497e+01
1716.lowfreq: -10.6994 -0.0024 -0.0023 -0.0022 0.2746 3.3172 16.1737 34.5603 43.7594
frequency: 15.5288 34.4469 43.4615 55.9779 73.7333 91.0388 105.6534 128.6770 135.7019 149.1820 164.5837 199.2002 235.8631 241.5366 257.4604 283.9187 359.7205 396.3482 422.3167 453.7513 501.1866 535.2645 565.3953 611.5243 629.8201 642.2284 667.9062 689.6498 728.8502 736.0189 750.9053 790.6959 822.1877 827.8709 832.7505 895.9527 908.2056 923.0993 949.2764 988.2983 1007.2324 1016.3125 1055.9725 1070.7674 1072.6746 1089.9217 1113.2280 1125.5126 1166.6992 1188.2153 1194.6062 1231.3998 1237.4226 1249.0446 1280.7875 1285.1787 1290.0177 1291.8683 1298.7869 1320.4686 1336.9461 1347.1848 1353.3337 1372.0781 1391.0128 1392.4791 1403.2886 1439.8398 1442.2893 1466.1374 1470.0808 1475.5256 1479.0638 1480.1145 1488.2654 1526.7403 1543.0420 2960.1340 2969.9117 2973.9336 2979.0846 2980.8471 2999.8039 3022.4892 3040.8210 3044.8003 3070.8573 3073.4462 3105.1405 3117.9062 3173.8063 3233.1035 3399.3188
redmass: 4.2824 2.2400 3.1276 5.9167 3.8398 5.0443 1.7219 3.9369 2.4047 8.6792 5.3429 3.4584 1.1103 5.1778 4.1895 5.7701 3.9602 5.1388 5.9770 5.2109 5.1326 4.3966 7.1435 1.5439 4.4732 3.1871 7.6838 6.3515 1.0663 6.4136 1.1147 5.2983 10.7889 1.1988 1.6167 1.8249 7.9481 1.4327 1.1986 3.1291 4.1539 2.1357 2.9500 1.1323 2.5000 5.4205 2.4470 5.0278 2.1197 2.3594 1.6073 1.3279 1.7193 1.2737 1.4297 5.0420 1.0762 1.1063 4.0625 2.2533 1.4033 1.9015 1.5899 2.5932 1.6565 1.2182 1.3286 1.0956 2.2124 1.0674 1.0750 1.2683 1.0420 1.0710 1.0876 9.0671 7.7762 1.0587 1.0591 1.0366 1.0678 1.0591 1.0990 1.1027 1.0572 1.1045 1.1009 1.0993 1.0979 1.1083 1.0924 1.0986 1.0661
irintensity: 0.2802 0.2444 0.0752 3.0738 4.2769 1.3419 0.3098 3.2148 0.6827 0.6320 1.6178 4.9762 0.0012 2.0745 4.8435 0.2186 0.6168 1.9103 5.3131 7.9398 5.1479 1.8500 6.1595 213.0774 25.9896 67.5430 2.8121 15.0621 12.7799 95.2519 0.2199 13.0307 30.4658 2.0514 13.5800 3.9439 69.2836 10.9143 0.3054 136.0184 1.1266 22.9126 7.1664 0.8218 0.2078 12.2100 39.7536 21.8971 228.3019 9.0393 0.0156 2.4552 14.9092 0.1113 1.7183 92.4726 0.6655 0.0766 52.3107 1.8026 13.9053 28.9060 1.0217 20.4608 67.6955 11.2693 109.4569 11.8112 20.5547 1.1669 0.9481 7.5812 12.8157 2.5559 19.1689 253.8888 68.5401 2.8027 35.6726 39.7386 68.1081 52.6351 0.0904 4.4157 9.9689 46.5772 88.3500 53.2571 19.8770 18.1664 12.9515 0.0079 83.5026
temp: 298.150 k
press: 1.00000 atm
elementType: 16 8 7 7 7 7 6 6 6 6 6 6 6 6 6 6 6 1 1 1 1 1 1 1 1 1 1 1 1 1 1 1 1
symmnumber: 1
zpe: 693739.2 jmol-1
zpe.correction: 0.264231 hartree
zpe.thermalcorrener: 0.281699 hartree
zpe.thermalcorrenthalpy: 0.282643 hartree
zpe.thermalcorrgfe: 0.215881 hartree
zpe.sumelectzpe: -1119.766435 hartree
zpe.sumelectthermal: -1119.748967 hartree
zpe.sumelectthermalent: -1119.748023 hartree
zpe.sumelectthermalfe: -1119.814785 hartree
dipole: 0.3489 0.4751 -1.5026
dipole: 1.6141
quadrupole: -92.6075 -112.5326 -110.7846
quadrupole: 9.1561 9.2672 -0.7083
quadrupole: 12.7007 -7.2243 -5.4764 9.1561 9.2672 -0.7083
hfenergy: -1120.0306659 hartree
pointgroup: C01 [X(C11H16N4O1S1)]
dipole: -0.1441659 -0.2686185 -0.5570571 debye
polarizability: 274.5237614|2.1611962|163.207935|-4.1799934|-7.9171018|94.9427264 unknown
InChI: InChI=1S/C11H16N4OS/c1-2-3-4-5-17-11-9-10(12-6-13-11)15(8-16)7-14-9/h6-7,16H,2-5,8H2,1H3
charge 0 multiplicity 1
33 atoms
S  -1.191596 1.255314 -0.117235
O  5.289445 -1.057974 0.828701
N  3.807455 0.520198 -0.238041
N  2.078903 2.036137 -0.293632
N  2.52448 -1.571373 0.00695
N  0.109357 -1.170156 0.051464
C  -5.116486 -0.302217 0.113161
C  -3.93613 0.694056 0.004784
C  -6.493939 0.399472 0.077983
C  -2.583133 -0.033352 0.043267
C  1.56558 0.729928 -0.17559
C  2.632378 -0.218612 -0.136027
C  0.25635 0.18442 -0.077089
C  -7.67269 -0.592757 0.17643
C  3.414665 1.866458 -0.320048
C  5.150032 -0.116625 -0.250754
C  1.220238 -1.968946 0.090921
H  -5.025991 -0.88393 1.053827
H  -5.058788 -1.036471 -0.716833
H  -3.996342 1.425561 0.834984
H  -4.028741 1.269726 -0.937655
H  -6.552116 1.130365 0.909904
H  -6.580034 0.986097 -0.859187
H  -2.463392 -0.745642 -0.788455
H  -2.420529 -0.572867 0.989805
H  -7.653389 -1.315404 -0.661084
H  -7.628068 -1.170582 1.118882
H  -8.645325 -0.068356 0.147684
H  4.138712 2.674976 -0.400264
H  5.282519 -0.60362 -1.238464
H  5.911679 0.664497 -0.106812
H  1.039957 -3.040879 0.207315
H  4.584139 -1.759343 0.716007
