program: Gaussian 09
title: 000264879
version: EM64L-G09RevD.01
frameworkgroup: C1[X(C26H26O2)]
method: RPBEPBE
basis: SDD
operation: Freq
keyword: #pfreq=noraman
keyword: PBEPBE/SDD
title: #p freq=noraman PBEPBE/SDD
converged: YES YES NO NO
title: Mulliken charges:
elementType: O O C C C C C C C C C C C C C C C C C C C C C C C C C C H H H H H H H H H H H H H H H H H H H H H H H H H H
charge: -0.193347 -0.183037 0.067341 0.119141 0.128302 0.157376 0.084505 0.231973 0.022533 0.011455 -0.850437 -0.817041 -0.856011 -0.851737 -0.679393 -0.662711 0.495284 0.480996 -0.426361 -0.365165 -0.399701 -0.394948 -0.229283 -0.234279 -0.228355 -0.233826 -0.243909 -0.246333 0.274230 0.258425 0.249391 0.243204 0.217246 0.257320 0.234169 0.246025 0.255639 0.252079 0.234593 0.236011 0.263023 0.244560 0.249193 0.237428 0.229417 0.258050 0.253062 0.237167 0.224068 0.224679 0.229826 0.228996 0.226883 0.232285
chargesum: 0.00000
title: Mulliken charges with hydrogens summed into heavy atoms:
elementType: O O C C C C C C C C C C C C C C C C C C C C C C C C C C
charge: -0.193347 -0.183037 0.067341 0.119141 0.128302 0.157376 0.084505 0.231973 0.022533 0.011455 -0.068391 -0.099271 -0.120178 -0.129055 -0.171810 -0.176090 0.495284 0.480996 -0.196944 -0.107114 -0.146639 -0.157781 -0.005215 -0.009600 0.001471 -0.004830 -0.017027 -0.014048
polarizability: 3.35913444e+02 -2.58342760e+01 3.07779751e+02 -1.13277282e+00 -3.15138921e+01 1.97852681e+02
1716.lowfreq: -21.7698 -5.8604 -0.0004 -0.0004 0.0002 1.3882 7.5956 15.6235 18.4710
frequency: -17.3762 15.4725 18.0097 24.2739 33.1274 41.3906 53.9914 69.5194 72.5492 87.5698 91.6007 110.4616 128.8672 135.0254 142.5525 164.3159 178.4045 196.1102 208.1364 233.7173 248.1820 266.9859 285.9122 314.7940 327.1481 331.0467 351.5177 363.4637 373.4618 401.9264 404.4184 408.6232 436.7569 462.0139 465.5477 477.0305 492.9798 517.9689 528.3584 557.0907 569.3276 580.3904 614.7724 615.3463 618.0279 640.1916 693.9017 701.4055 703.9277 723.7220 732.8647 755.0896 772.1079 782.8887 808.3764 833.1567 846.1369 850.2569 854.5511 904.1537 916.0873 927.8661 933.1838 946.4706 973.3468 978.5890 980.3338 989.5971 990.4006 993.4153 996.9372 1001.9427 1011.6517 1021.6770 1024.9557 1028.6043 1033.5195 1040.3953 1046.1842 1051.1832 1072.2175 1081.3580 1089.5632 1104.7696 1111.4771 1155.0920 1172.0321 1172.4000 1185.1508 1188.6165 1191.5651 1202.5742 1210.0362 1258.5820 1269.1119 1287.4246 1314.4306 1328.9757 1337.0650 1340.4643 1380.8473 1382.2502 1392.5531 1397.5285 1403.8916 1406.3839 1410.3415 1411.2440 1437.6712 1438.9662 1447.1513 1453.4069 1457.3746 1461.6486 1469.8410 1474.9240 1477.8709 1480.3442 1483.4660 1490.8923 1493.1755 1497.7894 1564.0191 1573.1895 1589.6809 1592.3167 1598.9272 1599.9988 1612.1937 1614.9516 2951.8269 2975.1292 2979.2384 2980.3177 2985.2798 3018.6549 3043.1733 3049.5978 3053.5161 3064.9742 3071.6531 3088.9001 3094.1741 3103.9804 3112.5427 3113.7568 3120.3458 3122.3842 3126.0656 3126.5428 3137.8880 3139.2396 3147.8560 3155.9784 3164.3923 3169.5402
redmass: 4.7678 5.3603 3.2655 3.2157 3.6214 2.9793 2.1674 2.2939 4.1161 4.2139 2.2255 2.9511 2.2946 1.3014 2.6118 4.2161 2.7497 2.5612 2.1886 1.9815 3.2288 5.2675 5.1167 3.1816 2.7944 2.8144 2.7308 2.8785 2.6199 2.8275 3.2195 3.5907 3.7546 4.3609 3.0972 3.6766 4.2808 4.0520 5.0231 3.9899 3.8236 3.4714 5.3074 5.7554 4.3364 4.5016 4.4964 2.2274 1.8364 2.2630 2.8730 2.2884 2.8981 3.3781 3.8444 3.7557 3.1377 1.3067 1.2545 1.7655 1.8055 2.0542 1.9276 2.3006 1.3952 1.4905 2.2864 5.8383 4.6441 1.3950 1.3197 1.4483 1.4147 2.1147 2.2536 2.2146 1.5483 1.5509 1.8550 1.6879 1.7630 1.6759 1.7906 2.2133 2.1409 1.2608 1.0549 1.0549 1.8550 1.1454 1.1606 2.5187 2.2412 1.5302 2.7551 2.1375 5.9227 1.2799 1.3428 6.3128 8.2687 7.7467 2.1425 1.4142 1.4089 1.7430 2.0030 1.3004 1.6770 2.1461 1.2747 1.1110 1.1681 1.0896 1.1138 1.0970 1.1158 2.0757 2.1951 1.1029 1.0865 1.0852 5.7895 5.7432 6.3224 6.0618 7.7947 7.6578 6.9689 6.4594 1.0681 1.0419 1.0395 1.0415 1.0411 1.0580 1.0952 1.0958 1.0971 1.0908 1.0929 1.1032 1.0984 1.0990 1.0944 1.0870 1.0859 1.0948 1.0870 1.0871 1.0922 1.0930 1.0964 1.0971 1.1016 1.0985
irintensity: 0.1562 0.0132 0.9163 0.1447 0.0022 0.2812 0.1348 2.0924 2.1360 1.8195 1.6786 0.2878 2.6857 1.0146 0.5097 1.0412 3.7137 1.3980 0.0079 1.0963 6.2484 1.3723 6.3712 2.9833 1.5023 0.9484 1.3885 0.3175 0.0429 0.0189 0.1314 0.7060 1.2550 2.3808 3.3874 5.0818 10.7429 8.0068 17.5336 9.7716 11.1739 4.3455 0.7481 0.6735 3.2862 8.3025 2.0211 26.2993 75.9474 38.1854 24.2655 34.5720 4.1911 4.2098 0.2291 3.7924 1.0943 0.6714 0.8173 3.5271 8.5843 11.1156 9.5823 22.7340 0.2404 4.7630 27.1360 0.2073 1.6022 0.2537 0.2355 3.9715 13.1386 25.3858 5.6327 12.4865 1.1391 6.9064 4.4413 1.7906 7.1909 2.9443 1.2593 16.6451 87.1206 2.3960 0.6722 0.1847 59.6890 2.9084 1.1283 8.0324 0.7782 48.2941 5.6627 43.8276 70.8402 4.7557 17.8959 2.6298 0.9269 1.3289 14.1645 1.4882 8.6112 47.3492 3.9506 23.3194 5.4567 9.4389 11.7353 17.5686 13.2813 9.1201 30.5697 22.9006 12.0610 22.9106 25.6280 29.7403 1.5821 5.1931 53.3251 17.3852 14.0677 1.6669 72.1222 98.5206 39.4365 33.2480 14.8958 42.7503 23.8642 22.6721 10.0099 15.9677 29.6825 5.2965 13.7799 11.1158 5.8594 25.2152 7.1878 10.0161 20.5527 8.8631 4.3486 8.9568 1.6118 0.0174 13.3098 32.2856 29.1704 32.1609 17.7275 10.5428
temp: 298.150 k
press: 1.00000 atm
elementType: 8 8 6 6 6 6 6 6 6 6 6 6 6 6 6 6 6 6 6 6 6 6 6 6 6 6 6 6 1 1 1 1 1 1 1 1 1 1 1 1 1 1 1 1 1 1 1 1 1 1 1 1 1 1
symmnumber: 1
zpe: 1155424.9 jmol-1
zpe.correction: 0.440078 hartree
zpe.thermalcorrener: 0.466603 hartree
zpe.thermalcorrenthalpy: 0.467547 hartree
zpe.thermalcorrgfe: 0.380544 hartree
zpe.sumelectzpe: -1154.824815 hartree
zpe.sumelectthermal: -1154.798290 hartree
zpe.sumelectthermalent: -1154.797346 hartree
zpe.sumelectthermalfe: -1154.884348 hartree
dipole: 2.1866 0.5639 4.1621
dipole: 4.7352
quadrupole: -153.9996 -156.3768 -173.1798
quadrupole: -14.0944 5.0149 -7.3362
quadrupole: 7.1858 4.8086 -11.9944 -14.0944 5.0149 -7.3362
hfenergy: -1155.2648926 hartree
pointgroup: C01 [X(C26H26O2)]
dipole: 0.5621799 0.3049478 -1.7497647 debye
polarizability: 303.1656909|15.5260998|342.1057958|4.8825624|-31.9083943|196.2743897 unknown
InChI: InChI=1S/C26H26O2/c1-17-18(2)25(23(27)15-21-11-7-5-8-12-21)20(4)26(19(17)3)24(28)16-22-13-9-6-10-14-22/h5-14H,15-16H2,1-4H3
charge 0 multiplicity 1
54 atoms
O  -3.246682 1.025469 0.990475
O  3.1054 0.941176 2.034048
C  -0.989432 1.508215 0.229118
C  1.427832 1.778892 0.470515
C  0.258488 0.995993 0.685039
C  -1.08698 2.807354 -0.355674
C  1.356759 3.07806 -0.108485
C  0.092379 3.595351 -0.51176
C  -2.229102 0.648109 0.348838
C  2.77255 1.190798 0.844257
C  0.34817 -0.333405 1.423602
C  -2.415254 3.377955 -0.826735
C  2.612026 3.935636 -0.226016
C  -0.027555 4.985841 -1.116404
C  -2.240266 -0.662797 -0.474986
C  3.699474 0.78449 -0.326159
C  -2.914933 -1.860039 0.180013
C  3.277377 -0.594697 -0.833311
C  -2.171759 -3.04549 0.414565
C  -4.283409 -1.825975 0.55601
C  3.700275 -1.765282 -0.151913
C  2.422537 -0.726629 -1.95742
C  -2.779002 -4.17454 1.010374
C  -4.889802 -2.952794 1.154223
C  3.281349 -3.041702 -0.589099
C  2.00037 -2.002943 -2.394767
C  -4.141975 -4.131577 1.382442
C  2.428454 -3.165434 -1.711497
H  0.909463 -0.205404 2.364347
H  -0.643877 -0.734425 1.682686
H  0.886044 -1.097984 0.830766
H  -2.726847 4.223893 -0.183998
H  -2.337371 3.771309 -1.85733
H  -3.231178 2.642701 -0.793233
H  2.841111 4.196417 -1.276737
H  2.489281 4.886732 0.324333
H  3.497479 3.440085 0.202456
H  0.915522 5.549673 -1.068499
H  -0.328601 4.936892 -2.181435
H  -0.801298 5.582998 -0.599186
H  -1.21208 -0.912829 -0.78527
H  -2.784377 -0.386827 -1.405661
H  4.734247 0.759854 0.05851
H  3.627776 1.520927 -1.14399
H  -1.113203 -3.085503 0.127134
H  -4.861664 -0.910931 0.396738
H  4.350581 -1.671381 0.725595
H  2.087402 0.171673 -2.490089
H  -2.19006 -5.082515 1.18342
H  -5.94645 -2.910985 1.442267
H  3.619642 -3.937463 -0.056312
H  1.345245 -2.090671 -3.268996
H  -4.615675 -5.005245 1.844316
H  2.105699 -4.155425 -2.052625
