program: Gaussian 09
title: 000264772
version: EM64L-G09RevD.01
frameworkgroup: C1[X(C13H10ClN5O2)]
method: RPBEPBE
basis: SDD
operation: Freq
keyword: #p
keyword: freq=noraman
keyword: PBEPBE/SDD
title: #p freq=noraman PBEPBE/SDD
converged: YES YES NO NO
title: Mulliken charges:
elementType: Cl O O N N N N N C C C C C C C C C C C C C H H H H H H H H H H
charge: 0.031631 -0.199396 -0.201994 -0.185322 -0.029575 -0.016277 0.063255 0.028587 -0.206616 0.468878 -0.717306 0.137856 -0.198303 0.131942 -0.335089 -0.389703 -0.371385 -0.370324 0.384940 -0.306527 -0.357552 0.280023 0.223888 0.234481 0.253410 0.287232 0.258600 0.260657 0.291737 0.289573 0.258680
chargesum: 0.00000
title: Mulliken charges with hydrogens summed into heavy atoms:
elementType: Cl O O N N N N N C C C C C C C C C C C C C
charge: 0.031631 -0.199396 -0.201994 -0.185322 -0.029575 -0.016277 0.063255 0.028587 0.073407 0.468878 -0.005527 0.137856 0.088929 0.131942 -0.076489 -0.129047 -0.079648 -0.080751 0.384940 -0.306527 -0.098872
polarizability: 2.80199083e+02 1.20937323e+01 1.63614094e+02 -2.24539325e+01 -2.78632498e+00 1.47833086e+02
1716.lowfreq: -5.6021 -0.0019 -0.0015 0.0003 1.2717 8.0339 10.5959 23.5767 28.9983
frequency: 10.3253 23.5134 28.9852 66.2588 74.0434 105.9359 123.8902 163.2364 181.3562 208.5048 228.3138 254.7356 257.6468 274.7921 294.2470 322.6419 380.4686 407.7197 416.8569 461.7683 478.0393 511.8272 538.3542 549.4604 583.4447 618.1422 625.9312 627.0281 652.2421 660.9135 671.3168 690.8769 744.3173 764.8829 790.1057 801.0729 809.5409 849.8565 854.1235 868.5066 896.1084 916.7100 989.9983 997.1857 999.4449 1006.1971 1039.1033 1073.5755 1094.0228 1098.2017 1113.7586 1132.9045 1169.1841 1187.9229 1189.8209 1216.4766 1223.4731 1269.9512 1285.1362 1297.4856 1305.0560 1322.0186 1362.6392 1368.6016 1379.4147 1398.6121 1399.8603 1401.1479 1416.8960 1441.1915 1477.6351 1481.9028 1484.0851 1505.5098 1560.8231 1599.2139 1611.0242 2992.5923 2998.0443 3095.8980 3104.4446 3144.3585 3163.7006 3183.9454 3186.5138 3187.9225 3234.7348
redmass: 7.1815 5.8310 11.3777 7.1991 6.3351 8.9669 5.1982 7.2801 8.9027 8.4208 5.1575 2.7343 3.5496 1.9533 2.6834 6.0066 16.0517 2.9116 4.9936 4.3301 4.1091 5.9879 6.8851 5.4859 7.2134 4.6466 7.1213 6.7892 4.8330 6.1044 5.4819 4.1113 4.7062 4.0630 7.3476 10.2340 5.8357 1.5186 1.2442 1.6228 6.3831 1.4343 1.4143 2.2870 1.3763 2.8979 1.8652 2.4576 3.0821 3.0730 3.3111 1.7001 4.6286 1.4394 2.1623 2.5298 4.4501 2.5065 9.7879 1.3610 3.7500 1.4845 5.3335 6.0932 1.4823 1.5591 1.9046 3.8606 3.2685 4.4145 1.0787 1.2422 1.7119 9.3224 11.1288 7.7958 6.1934 1.0771 1.0425 1.1004 1.1000 1.0906 1.0887 1.0949 1.0962 1.0931 1.0987
irintensity: 0.9304 0.7448 0.7773 0.0549 0.7534 1.2638 0.3757 1.6907 2.7419 0.2268 0.9162 0.8356 1.1691 0.1153 1.4071 0.9235 7.5899 1.0452 3.8945 1.5503 7.1384 1.6581 18.0101 3.4837 2.2772 3.1526 0.3401 7.5375 22.9067 3.5188 6.1097 37.0308 26.2617 8.8064 5.0958 25.6772 15.6621 12.0628 0.0361 46.2951 114.0186 11.7281 4.7262 8.5977 0.3335 6.1357 1.1570 28.8876 13.0886 37.9635 2.9650 0.7122 85.4177 51.2248 91.8329 154.6048 175.0441 5.4070 48.5793 7.8864 87.5172 5.0434 30.4681 73.6534 24.4428 13.5285 52.0841 1.4246 77.0452 97.6511 12.4400 11.2805 6.2568 145.8761 117.5536 1.2432 44.3837 18.3101 9.8006 18.7548 22.8628 6.5757 4.4705 0.0189 5.1757 8.2736 0.4615
temp: 298.150 k
press: 1.00000 atm
elementType: 17 8 8 7 7 7 7 7 6 6 6 6 6 6 6 6 6 6 6 6 6 1 1 1 1 1 1 1 1 1 1
symmnumber: 1
zpe: 574085.9 jmol-1
zpe.correction: 0.218658 hartree
zpe.thermalcorrener: 0.236078 hartree
zpe.thermalcorrenthalpy: 0.237022 hartree
zpe.thermalcorrgfe: 0.169713 hartree
zpe.sumelectzpe: -1384.086286 hartree
zpe.sumelectthermal: -1384.068866 hartree
zpe.sumelectthermalent: -1384.067922 hartree
zpe.sumelectthermalfe: -1384.135231 hartree
dipole: 0.5962 5.5287 0.2153
dipole: 5.5649
quadrupole: -180.1760 -124.6413 -128.5494
quadrupole: 8.2775 -5.2635 -4.8506
quadrupole: -35.7204 19.8143 15.9061 8.2775 -5.2635 -4.8506
hfenergy: -1384.3049436 hartree
pointgroup: C01 [X(C13H10Cl1N5O2)]
dipole: -0.1277254 2.0571039 -0.7386068 debye
polarizability: 278.332068|-23.9793353|165.8801291|-16.9643407|-1.5435967|147.4340655 unknown
InChI: InChI=1S/C13H10ClN5O2/c1-8(9-2-4-10(5-3-9)19(20)21)18-7-17-11-12(14)15-6-16-13(11)18/h2-8H,1H3
charge 0 multiplicity 1
31 atoms
Cl 5.385097 -1.682556 1.421686
O  -5.138808 -2.279232 0.080227
O  -6.048008 -0.264135 0.644511
N  1.182137 0.792946 0.091033
N  2.425466 -0.103611 1.811704
N  2.64914 0.212864 -1.813225
N  4.659775 -0.98005 -1.098473
N  -5.05891 -1.005877 0.273568
C  0.114553 1.534242 -0.637645
C  -1.25439 0.893056 -0.363371
C  0.216228 3.044319 -0.343312
C  2.319331 0.240141 -0.497434
C  1.304181 0.557385 1.470514
C  3.084073 -0.313935 0.588593
C  -1.404701 -0.507274 -0.55705
C  -2.378488 1.654046 0.041976
C  -2.643503 -1.139094 -0.352561
C  -3.629497 1.038813 0.254899
C  -3.743034 -0.351128 0.054027
C  4.291575 -0.931847 0.192984
C  3.837257 -0.415326 -2.043893
H  0.36275 1.371434 -1.706065
H  -0.003572 3.275214 0.714036
H  -0.484189 3.611825 -0.980081
H  1.236445 3.396857 -0.568294
H  0.541563 0.874701 2.178719
H  -0.542855 -1.10527 -0.873276
H  -2.289531 2.733074 0.195198
H  -2.776358 -2.213946 -0.499788
H  -4.506939 1.609961 0.569308
H  4.174913 -0.480592 -3.080717
