program: Gaussian 09
title: 000264115
version: EM64L-G09RevD.01
frameworkgroup: C1[X(C22H26N4)]
method: RPBEPBE
basis: SDD
operation: Freq
keyword: #pfreq=noraman
keyword: PBEPBE/SDD
title: #p freq=noraman PBEPBE/SDD
converged: NO YES NO NO
title: Mulliken charges:
elementType: N N N N C C C C C C C C C C C C C C C C C C C C C C H H H H H H H H H H H H H H H H H H H H H H H H H H
charge: -0.028526 -0.028526 -0.403497 -0.403496 0.175207 0.175208 -0.377210 -0.377213 -0.477787 -0.477788 0.363854 0.363849 -0.449203 -0.449202 0.292034 0.292029 -0.397113 -0.397114 -0.642637 -0.642635 -0.454136 -0.454133 -0.307425 -0.307425 -0.220188 -0.220189 0.251800 0.251800 0.201387 0.254500 0.201387 0.254500 0.215602 0.217111 0.215602 0.217108 0.277427 0.277428 0.212875 0.212876 0.229971 0.216886 0.197701 0.216886 0.197704 0.229970 0.214994 0.214994 0.218137 0.218137 0.218240 0.218240
chargesum: 0.00000
title: Mulliken charges with hydrogens summed into heavy atoms:
elementType: N N N N C C C C C C C C C C C C C C C C C C C C C C
charge: -0.028526 -0.028526 -0.126070 -0.126069 0.175207 0.175208 -0.125410 -0.125413 -0.021900 -0.021901 0.363854 0.363849 -0.016491 -0.016492 0.292034 0.292029 -0.184238 -0.184238 0.001922 0.001925 -0.239142 -0.239140 -0.089288 -0.089288 -0.001949 -0.001949
polarizability: 2.34115507e+02 -1.41251124e-04 2.55548045e+02 7.04702318e+00 -4.69945360e-04 2.57244579e+02
1716.lowfreq: -18.1456 -10.7635 -0.0004 0.0008 0.0010 6.2453 49.1517 73.5300 91.2160
frequency: 49.1160 73.5273 91.2030 113.6273 115.7190 131.7855 133.8822 180.8671 188.5802 218.3470 231.6021 258.1593 258.7295 273.7097 276.9378 299.3314 300.6405 313.4689 315.7141 329.5139 342.4636 344.1921 347.4922 360.6686 412.4853 415.1256 447.8313 464.6999 487.5915 508.7884 519.7859 537.3344 559.1499 563.2717 567.0069 575.6515 595.7680 623.8232 646.2432 656.1869 706.0710 739.0829 740.0101 742.7958 743.2467 762.7121 774.0664 777.9444 779.0655 819.2241 835.5660 838.7360 849.8150 880.8167 918.4809 918.8064 945.2872 950.9448 958.3516 958.9878 960.4021 966.9486 999.2980 1004.4169 1036.8899 1038.0466 1046.2650 1053.8225 1061.3200 1062.0009 1068.7488 1081.4317 1105.8129 1106.3955 1113.9232 1124.6576 1127.6757 1128.5088 1150.8208 1159.0990 1170.9201 1171.5316 1176.2139 1186.2228 1198.7430 1209.4978 1228.8264 1237.7867 1258.0738 1258.3627 1265.3766 1275.3780 1277.5794 1280.8327 1301.1439 1313.5757 1315.4280 1333.9224 1351.1618 1356.3713 1367.9326 1368.7956 1383.9335 1385.2669 1421.5099 1422.5644 1429.1288 1430.2280 1454.8745 1460.3979 1460.5341 1477.6578 1477.7706 1481.3331 1483.1200 1484.0984 1493.0497 1493.3672 1496.0728 1496.4467 1587.9585 1588.0520 1615.6115 1618.9906 2877.8337 2878.0321 2891.3688 2892.3185 2995.6137 2996.6127 3009.7785 3010.2115 3014.0112 3014.0762 3016.3150 3017.6100 3069.4122 3069.4409 3073.2837 3079.2959 3107.8509 3107.9946 3117.4272 3117.5989 3134.7486 3134.8106 3158.5153 3158.7572 3572.3033 3572.4854
redmass: 5.1740 3.5550 4.2646 3.6663 3.8132 2.9502 3.5427 2.4293 3.6964 1.2469 1.3637 2.2786 3.1155 2.5064 3.1172 1.5527 3.2833 2.2276 3.5165 1.3855 2.7312 3.0091 2.7100 2.8894 4.0748 3.7287 4.1326 3.2329 3.2835 3.6909 3.2673 3.5252 3.6585 3.9197 5.9452 5.1981 3.1656 5.3542 4.1982 5.4376 4.1317 1.9437 3.3031 1.4024 2.0168 3.7877 3.3760 2.7497 2.5752 3.8074 1.5067 1.5793 3.1319 2.5291 1.4194 1.4034 3.0238 2.0313 1.4886 1.3007 2.1199 3.1841 3.8262 4.0877 2.4661 2.2895 2.1506 1.9171 2.0331 2.5841 2.6743 2.8396 2.6385 1.6552 1.6932 2.5351 1.7836 2.3271 1.6877 1.6414 1.0707 1.1119 2.1082 2.1022 2.0987 2.2532 2.0783 1.5629 1.5373 1.6767 1.6399 1.7616 1.8628 1.7953 1.5844 1.6019 1.3767 1.5636 1.3598 1.3204 1.3826 1.4253 3.9874 3.7780 1.8781 2.0083 1.1833 1.2226 1.0880 1.0510 1.0519 1.4739 1.3488 1.3576 1.3586 1.2518 1.0932 1.1009 2.8533 2.3992 6.0558 6.0566 6.4446 6.4926 1.0543 1.0547 1.0689 1.0685 1.0658 1.0667 1.0850 1.0842 1.0767 1.0764 1.0890 1.0875 1.1006 1.1006 1.0977 1.0962 1.0865 1.0866 1.0869 1.0869 1.0927 1.0927 1.1001 1.1001 1.0776 1.0777
irintensity: 0.1015 1.9967 0.9228 1.5016 0.1953 3.4168 1.4845 0.0000 0.6746 3.1723 4.1119 2.1916 1.9386 0.0883 6.2575 57.8090 20.5387 50.6270 4.1401 25.5219 3.4683 4.2396 16.9510 14.8590 0.0018 0.6265 6.2654 0.9805 19.2947 4.0796 1.5453 0.2556 4.8938 0.2324 0.3258 7.2425 20.4941 9.6228 10.6757 1.8622 1.8888 44.0209 0.0331 41.8493 69.2891 29.4929 2.3511 3.1317 0.6973 2.9174 2.3064 4.5696 11.4591 11.1649 0.0152 0.7734 10.1102 4.6315 0.9241 0.2783 0.9162 31.2144 32.4746 138.5106 44.8000 23.3613 5.4828 0.7967 17.5384 25.8927 12.8983 9.9204 14.5862 0.1643 14.5480 0.0024 14.3139 3.9458 0.2421 58.4216 0.3887 0.6669 35.7072 2.2614 5.2623 23.0575 10.0636 5.3554 8.1284 8.2314 40.3372 3.5154 42.2845 7.6858 6.4933 24.4073 13.9482 0.6052 16.9403 5.1040 7.4526 6.2799 16.2449 22.8258 5.4059 0.2112 2.8886 12.0396 4.4882 29.3022 22.5859 32.8525 23.3399 5.5173 57.2598 2.4076 22.1873 9.5367 105.0335 68.0736 11.2145 0.1495 42.9272 88.2550 170.7949 0.1447 199.8589 5.0862 25.2772 0.8209 13.2390 65.2463 30.6984 68.6298 18.3644 97.8830 26.4722 38.3114 14.5369 28.4984 0.0567 26.2919 4.8136 5.7095 18.1401 49.4839 42.5463 28.3164 38.0574 0.0741
temp: 298.150 k
press: 1.00000 atm
elementType: 7 7 7 7 6 6 6 6 6 6 6 6 6 6 6 6 6 6 6 6 6 6 6 6 6 6 1 1 1 1 1 1 1 1 1 1 1 1 1 1 1 1 1 1 1 1 1 1 1 1 1 1
symmnumber: 1
zpe: 1153199.3 jmol-1
zpe.correction: 0.439230 hartree
zpe.thermalcorrener: 0.460451 hartree
zpe.thermalcorrenthalpy: 0.461395 hartree
zpe.thermalcorrgfe: 0.392600 hartree
zpe.sumelectzpe: -1071.051634 hartree
zpe.sumelectthermal: -1071.030414 hartree
zpe.sumelectthermalent: -1071.029469 hartree
zpe.sumelectthermalfe: -1071.098264 hartree
dipole: 0.0001 -0.7500 0.0000
dipole: 0.7500
quadrupole: -146.8673 -155.0009 -142.0084
quadrupole: -0.0002 13.0075 -0.0004
quadrupole: 1.0915 -7.0420 5.9505 -0.0002 13.0075 -0.0004
hfenergy: -1071.4908642 hartree
pointgroup: C01 [X(C22H26N4)]
dipole: 0.0000346 -0.2950631 -0.0000359 debye
polarizability: 232.3594828|-0.0003984|255.5480453|2.4416615|-0.0010317|259.0006028 unknown
InChI: InChI=1S/C22H26N4/c1-25-13-11-22-16-8-4-5-9-17(16)23-19(25)21(22)12-14-26(2)20(22)24-18-10-6-3-7-15(18)21/h3-10,19-20,23-24H,11-14H2,1-2H3
charge 0 multiplicity 1
52 atoms
N  1.67893 -2.061697 1.531994
N  -1.67897 -2.061202 -1.532615
N  1.692989 0.426429 1.504796
N  -1.69304 0.426915 -1.504593
C  -0.310711 -0.789414 0.722787
C  0.31067 -0.789174 -0.722989
C  0.900914 -0.805989 1.70488
C  -0.900957 -0.805433 -1.705084
C  1.19815 -2.056575 -0.926019
C  -1.198177 -2.056889 0.925405
C  -1.181771 0.467826 0.896508
C  1.18172 0.468131 -0.896293
C  2.271213 -2.19005 0.172037
C  -2.27124 -2.190024 -0.172696
C  1.84009 1.024223 0.247271
C  -1.840138 1.024296 -0.246872
C  -1.410253 1.066112 2.155676
C  1.410187 1.066844 -2.15526
C  2.689934 -2.258928 2.589036
C  -2.689994 -2.258054 -2.58971
C  2.658143 2.17959 0.099925
C  -2.658191 2.179616 -0.099144
C  -2.236824 2.201233 2.309658
C  2.236758 2.202015 -2.308867
C  2.853288 2.763217 -1.165373
C  -2.853344 2.76282 1.166347
H  0.543681 -0.809217 2.751863
H  -0.543726 -0.808312 -2.752069
H  1.702183 -1.983827 -1.909353
H  0.553216 -2.949901 -0.953384
H  -1.702212 -1.984465 1.908762
H  -0.553232 -2.950217 0.952482
H  2.744456 -3.188081 0.102746
H  3.077105 -1.433196 0.015174
H  -2.744456 -3.188092 -0.103736
H  -3.077154 -1.433245 -0.01558
H  2.090316 0.898587 2.314931
H  -2.090321 0.89937 -2.314577
H  -0.928142 0.645067 3.046028
H  0.92807 0.646097 -3.04575
H  3.128884 -3.2685 2.492592
H  2.211694 -2.190024 3.583505
H  3.525711 -1.518386 2.546331
H  -2.21177 -2.188801 -3.584162
H  -3.525758 -1.517515 -2.546724
H  -3.128951 -3.267655 -2.493613
H  3.143347 2.610494 0.985251
H  -3.143393 2.610814 -0.984329
H  -2.391456 2.643733 3.299337
H  2.391384 2.644847 -3.298399
H  3.488387 3.651606 -1.260292
H  -3.488441 3.651178 1.261559
