program: Gaussian 09
title: 000264207
version: EM64L-G09RevD.01
frameworkgroup: C1[X(C27H24O6S2)]
method: RPBEPBE
basis: SDD
operation: Freq
keyword: #p
keyword: freq=noraman
keyword: PBEPBE/SDD
title: #p freq=noraman PBEPBE/SDD
converged: YES YES NO NO
title: Mulliken charges:
elementType: S S O O O O O O C C C C C C C C C C C C C C C C C C C C C C C C C C C H H H H H H H H H H H H H H H H H H H H H H H H
charge: 0.150231 0.164213 -0.218840 -0.268201 -0.253745 -0.146882 -0.275421 -0.193618 -0.576624 0.019366 -0.430216 -0.024890 -0.317600 -0.249859 0.230541 -0.223327 -0.504626 0.416652 0.206952 0.399103 -0.301027 -0.366230 -0.341394 -0.319048 -0.346768 -0.310682 -0.236259 -0.216118 -0.222874 -0.227725 -0.220184 -0.230833 -0.227712 -0.221515 -0.221271 0.367820 0.277895 0.346612 0.197637 0.251044 0.220883 0.234786 0.202391 0.246484 0.280537 0.269016 0.263519 0.283784 0.275019 0.252086 0.260373 0.235919 0.233270 0.233784 0.236014 0.234342 0.235194 0.232573 0.235450
chargesum: 0.00000
title: Mulliken charges with hydrogens summed into heavy atoms:
elementType: S S O O O O O O C C C C C C C C C C C C C C C C C C C C C C C C C C C
charge: 0.150231 0.164213 -0.218840 -0.268201 -0.253745 -0.146882 -0.275421 -0.193618 -0.208805 0.297261 -0.083604 0.172747 0.154327 -0.249859 0.230541 -0.223327 0.179036 0.416652 0.206952 0.399103 -0.020490 -0.097214 -0.077876 -0.035264 -0.071749 -0.058596 0.024114 0.019801 0.010396 0.006059 0.015830 0.003509 0.007482 0.011058 0.014178
polarizability: 3.79067502e+02 2.28014072e+01 3.62248867e+02 3.93146777e+01 1.15057384e+01 3.23362093e+02
1716.lowfreq: -8.5892 -3.0762 -0.0011 -0.0009 0.0013 0.8887 8.7716 13.3648 16.1683
frequency: 8.0574 12.3257 15.8199 21.1733 23.2340 30.0181 36.1370 41.1174 43.8267 46.1180 64.4375 74.9647 91.0028 103.9286 107.4035 117.7004 126.1918 140.9859 151.0701 158.8687 164.0181 173.1574 177.9059 190.6647 225.7448 240.5011 257.4008 281.6900 299.1466 308.7126 316.1470 365.3956 384.2041 389.9592 397.1147 401.4004 403.3524 409.2011 411.4456 428.0303 429.6130 441.9597 483.2133 493.3871 503.4991 521.3142 528.5806 610.1242 612.1955 613.3393 617.1103 629.9194 630.0636 643.2699 655.7031 667.6775 677.2106 680.4202 691.9661 700.3051 703.5512 726.1405 781.4471 784.1489 784.4819 795.8371 813.3992 841.5592 851.0921 857.1449 863.1027 865.3853 865.8267 881.8066 921.1145 935.4109 946.7792 947.3033 955.6739 962.4144 987.0899 988.9872 989.1411 990.2568 990.6370 997.0786 1003.1970 1007.4706 1007.7677 1009.4978 1019.7920 1025.5566 1026.4526 1030.4801 1056.2844 1059.4121 1086.6982 1088.6014 1088.9672 1112.0646 1118.4704 1137.0521 1163.2529 1173.8607 1174.3633 1175.3569 1182.7551 1183.0776 1188.8375 1191.0549 1202.8385 1207.3367 1210.6964 1237.1099 1242.7898 1254.2812 1309.0530 1312.0520 1312.8459 1317.4118 1321.4211 1330.2140 1346.6678 1362.0005 1368.8489 1385.3008 1388.3898 1389.7908 1431.1891 1432.4654 1436.0383 1438.1717 1445.3289 1454.2245 1470.6476 1476.8435 1477.2372 1477.4013 1574.6577 1580.2415 1582.5862 1601.1478 1602.7561 1608.4413 1609.7730 1614.3710 1624.5048 2857.6279 2940.2697 2957.9978 3007.9537 3061.9501 3069.4391 3079.9883 3107.0381 3128.7376 3129.7555 3131.3897 3134.1705 3139.1858 3142.6231 3148.6983 3149.9999 3154.9257 3160.0418 3161.7594 3166.4168 3167.1161 3171.9495 3179.9091 3179.9272
redmass: 6.4987 5.2437 5.6208 4.5247 5.6017 5.4855 7.4214 6.6426 5.1435 6.2676 4.9500 6.0130 5.2310 4.1653 2.2714 6.1463 6.1145 2.5547 3.7768 4.2648 5.4488 5.4736 5.6178 7.6898 6.6171 4.7088 8.2311 6.0833 6.7314 7.8498 6.4779 4.7278 4.1090 5.4339 2.8387 4.9918 2.9123 3.1423 8.9716 6.7740 4.2449 3.9973 7.0031 5.6331 6.5497 8.4692 6.6664 6.3591 6.4666 6.4426 6.3670 5.1818 5.0393 6.9004 7.3894 7.4009 5.4140 6.1987 1.7774 1.6219 1.8055 4.8741 5.8603 1.9220 1.8802 2.1342 5.3068 5.3176 5.2348 1.2521 1.3157 1.2565 4.3654 5.6001 4.1464 4.9521 1.4075 1.4174 1.4590 4.7614 1.5943 5.6040 4.6378 4.8814 1.5022 1.3888 2.2232 1.7083 1.3432 1.3422 2.8043 2.0300 2.1783 2.3475 2.8506 2.6300 1.6432 1.6548 1.6007 1.3313 2.0517 2.3620 1.7361 1.0592 1.0557 1.0641 1.1832 1.2477 1.2399 1.1974 2.2404 1.7275 1.8530 1.3634 3.3418 1.2126 1.2925 1.3239 1.4278 1.2992 1.3112 1.2121 1.3957 1.3243 1.4578 8.6391 9.1014 9.9493 1.1743 2.2425 2.2641 2.2436 1.0821 1.0518 2.2053 2.2707 2.1736 1.0544 7.5030 6.0760 7.0404 8.0643 6.2922 6.1640 6.6949 8.3013 11.8585 1.0809 1.0693 1.0383 1.0852 1.0848 1.0943 1.0863 1.0943 1.1032 1.0855 1.0854 1.0861 1.0887 1.0892 1.0900 1.0927 1.0940 1.0908 1.0962 1.0973 1.0983 1.1012 1.0999 1.0976
irintensity: 0.0493 0.1918 0.1823 0.2760 0.1574 0.5539 0.6997 1.0852 1.0903 2.4898 2.7449 2.9329 0.7742 3.3940 2.4113 1.1289 0.7253 1.5039 2.3831 0.9311 0.6912 1.3069 0.6064 6.2295 8.4246 1.7458 8.4905 14.4601 3.0508 9.5052 8.5884 3.7348 1.6250 4.5762 0.0659 0.8978 0.0290 1.3173 1.2441 5.0530 0.5182 1.4197 11.8692 2.5186 5.7182 12.8073 12.0289 2.4223 4.4463 0.4245 12.5412 53.5708 11.1867 26.6400 72.6490 76.8923 16.4843 4.3191 51.6163 90.2008 74.3308 41.0716 18.7274 82.9506 19.8536 21.1681 30.0234 40.7578 137.7129 0.4499 10.9060 4.7109 134.9242 119.3511 22.7656 20.7903 9.4364 3.2298 0.3544 64.5813 6.5395 1.4548 1.3989 0.9783 0.5879 0.2245 69.9734 33.0896 0.6503 3.6861 63.9402 5.4342 0.4768 46.3857 160.5629 80.0310 6.6859 11.5731 23.6048 14.0045 133.9106 15.4351 59.3286 1.3987 0.3498 4.1754 34.1075 48.8330 82.4588 20.1835 99.6564 32.3337 141.8426 2.2409 324.6103 1.4584 2.9915 19.3862 15.9493 1.0921 3.4225 10.2175 11.1653 11.7674 17.8496 1.7857 3.5931 4.0613 13.2310 24.3520 17.0706 15.4257 14.8914 10.4803 4.7229 7.5595 4.4013 14.5164 60.3785 22.6882 61.3167 43.8147 31.4829 25.8971 19.0978 166.2505 278.3994 72.5924 41.1081 84.3162 30.4213 9.4829 35.6889 0.6259 14.6753 21.1460 0.4203 0.3734 2.3132 5.6653 10.3513 6.9973 15.3871 17.0916 4.5668 12.1107 18.1198 21.4041 25.0352 6.8308 7.4149
temp: 298.150 k
press: 1.00000 atm
elementType: 16 16 8 8 8 8 8 8 6 6 6 6 6 6 6 6 6 6 6 6 6 6 6 6 6 6 6 6 6 6 6 6 6 6 6 1 1 1 1 1 1 1 1 1 1 1 1 1 1 1 1 1 1 1 1 1 1 1 1
symmnumber: 1
zpe: 1170985.7 jmol-1
zpe.correction: 0.446005 hartree
zpe.thermalcorrener: 0.479031 hartree
zpe.thermalcorrenthalpy: 0.479976 hartree
zpe.thermalcorrgfe: 0.374078 hartree
zpe.sumelectzpe: -2288.225358 hartree
zpe.sumelectthermal: -2288.192331 hartree
zpe.sumelectthermalent: -2288.191387 hartree
zpe.sumelectthermalfe: -2288.297284 hartree
dipole: 5.1318 2.3810 2.2761
dipole: 6.0980
quadrupole: -201.7033 -216.6045 -197.4699
quadrupole: -10.3249 9.4176 -7.5784
quadrupole: 3.5559 -11.3453 7.7894 -10.3249 9.4176 -7.5784
hfenergy: -2288.6713626 hartree
pointgroup: C01 [X(C27H24O6S2)]
dipole: 1.1970255 -2.0641091 0.2498694 debye
polarizability: 355.6725492|-30.0132937|392.4110022|25.4877738|-5.1367756|316.5949106 unknown
InChI: InChI=1S/C27H24O6S2/c1-31-27-22(33-24(28)18-11-5-2-6-12-18)23(35-26(30)20-15-9-4-10-16-20)21(17-32-27)34-25(29)19-13-7-3-8-14-19/h2-16,21-23,27H,17H2,1H3
charge 0 multiplicity 1
59 atoms
S  -1.985347 3.232968 -0.408733
S  0.67191 -0.245921 -1.650571
O  1.829746 2.872252 -1.349462
O  1.366996 1.217228 0.990143
O  2.383982 3.780761 0.762195
O  -4.665697 2.995701 -0.58063
O  0.226624 0.878047 2.999958
O  -1.373402 -0.499413 -3.476255
C  -0.677528 1.821852 -0.25303
C  0.461346 2.341537 0.659616
C  -0.198285 1.454565 -1.673749
C  1.301009 3.400518 -0.073665
C  0.723486 2.536197 -2.262509
C  -3.689736 2.463158 -0.01474
C  1.16406 0.575822 2.216149
C  -0.429866 -1.103818 -2.906748
C  3.189231 4.888393 0.218304
C  -3.784676 1.329713 0.945823
C  2.177877 -0.4894 2.44781
C  -0.087478 -2.531945 -3.17202
C  -2.885481 1.166707 2.031174
C  -4.866562 0.418361 0.783498
C  2.085906 -1.2581 3.637401
C  3.218188 -0.742085 1.515072
C  -0.813365 -3.202005 -4.19571
C  0.914403 -3.234453 -2.450516
C  -3.050962 0.094413 2.93268
C  -5.024187 -0.653789 1.683471
C  3.027355 -2.275843 3.892266
C  4.157249 -1.761857 1.776222
C  -0.536514 -4.550527 -4.494863
C  1.186718 -4.584654 -2.752429
C  -4.115536 -0.81963 2.757878
C  4.064171 -2.529535 2.961919
C  0.464537 -5.245415 -3.774476
H  -1.190738 0.972545 0.223042
H  0.051973 2.758163 1.596213
H  -1.062979 1.288252 -2.345195
H  0.639715 4.272936 -0.315703
H  1.198813 2.193436 -3.19323
H  0.11511 3.44444 -2.472816
H  3.930703 5.120212 0.997087
H  2.554668 5.778316 0.026208
H  3.691928 4.581116 -0.714434
H  -2.074374 1.881041 2.199044
H  -5.564587 0.565687 -0.047123
H  1.277784 -1.040372 4.343534
H  3.278985 -0.135783 0.60716
H  -1.584429 -2.646596 -4.739422
H  1.473709 -2.734824 -1.651813
H  -2.340267 -0.019125 3.756564
H  -5.8518 -1.358807 1.550635
H  2.957401 -2.868241 4.81088
H  4.963809 -1.955199 1.060762
H  -1.097249 -5.06036 -5.28561
H  1.957847 -5.122489 -2.190869
H  -4.240334 -1.655687 3.455021
H  4.797185 -3.31925 3.162223
H  0.679252 -6.294513 -4.006428
