program: Gaussian 09
title: 000264757
version: EM64L-G09RevD.01
frameworkgroup: C1[X(C16H20N6O2)]
method: RPBEPBE
basis: SDD
operation: Freq
keyword: #p
keyword: freq=noraman
keyword: PBEPBE/SDD
title: #p freq=noraman PBEPBE/SDD
converged: YES YES NO NO
title: Mulliken charges:
elementType: O O N N N N N N C C C C C C C C C C C C C C C C H H H H H H H H H H H H H H H H H H H H
charge: -0.508122 -0.467237 -0.131951 -0.271280 -0.095611 -0.117753 -0.040658 -0.707447 0.236600 -0.090959 -0.444661 -0.433409 0.095316 0.509771 -0.266806 -0.288307 -0.290659 -0.590041 -0.402954 0.354400 0.325839 -0.391936 -0.398710 -0.844462 0.296098 0.284837 0.281528 0.237795 0.269040 0.218693 0.211717 0.209715 0.191180 0.226746 0.292264 0.242048 0.228662 0.225486 0.242006 0.225506 0.368243 0.377436 0.326290 0.305747
chargesum: 0.00000
title: Mulliken charges with hydrogens summed into heavy atoms:
elementType: O O N N N N N N C C C C C C C C C C C C C C C C
charge: -0.139879 -0.089802 -0.131951 -0.271280 -0.095611 -0.117753 -0.040658 -0.075409 0.236600 -0.090959 0.136274 0.085915 0.095316 0.509771 0.002234 0.142103 0.110237 -0.363294 -0.110690 0.354400 0.325839 -0.149889 -0.170049 -0.151463
polarizability: 3.90987004e+02 6.20189573e+00 2.27142056e+02 -6.22195913e-01 -3.33895321e+00 1.21701791e+02
1716.lowfreq: -6.9900 -0.0005 -0.0002 0.0004 3.0272 5.3006 13.7523 22.4909 35.6585
frequency: 13.6031 22.3417 35.6279 46.5684 62.8941 98.0500 118.5047 124.6067 147.2051 158.6104 164.3190 180.5246 209.3354 211.0199 228.8724 243.9456 250.1345 273.9829 284.2063 292.6783 303.2151 307.7511 333.6893 354.6600 365.7151 395.6580 416.7021 451.2204 452.8054 468.2108 514.9881 529.5100 542.3508 555.1238 584.7178 600.7617 618.9398 643.8981 660.0618 666.2077 678.8914 688.6553 717.8064 747.8571 781.3509 782.2246 806.5707 812.2264 842.0181 850.9193 853.5951 880.5921 888.4960 905.9628 928.5396 942.8131 972.6489 986.1839 993.8690 1015.6369 1034.2465 1042.7194 1060.5037 1068.2705 1078.6301 1099.0420 1104.6501 1152.4923 1165.9159 1170.6524 1207.7344 1210.0904 1212.9719 1219.6840 1239.8768 1259.2897 1267.0774 1295.4443 1297.4848 1315.6149 1321.3892 1341.5989 1349.0478 1367.6064 1373.0238 1382.7728 1390.6492 1392.1299 1399.0119 1411.6255 1422.5126 1433.5704 1452.3089 1462.7907 1466.9645 1473.3926 1473.6710 1476.6806 1479.6980 1482.8539 1518.7923 1522.1726 1569.8863 1593.8706 1629.5285 1643.8360 2943.4509 2950.0325 2970.7629 2995.0647 3001.3623 3016.3037 3037.8578 3043.5597 3065.8240 3078.0583 3086.0064 3130.2568 3132.6248 3155.1006 3195.9318 3244.3827 3320.9184 3574.1635 3596.4692 3713.7447
redmass: 5.1394 4.1322 4.8811 5.0343 5.0211 5.0744 3.5748 5.1053 3.6806 4.4320 4.4600 1.0719 4.1680 6.0603 4.4462 1.7367 2.0957 3.8642 4.4371 3.5339 2.6354 3.3339 1.3588 2.5269 3.7393 1.3207 2.3768 2.9050 3.5119 3.3391 2.9917 5.2852 2.7410 3.7557 5.2797 4.6971 4.6655 5.1094 5.8696 7.0193 3.5315 1.2686 2.4866 4.4109 4.2593 4.6525 1.5304 1.5530 4.3353 2.6561 2.3014 6.3199 2.7078 2.4042 1.4262 1.3485 2.2995 1.8940 2.1374 2.6609 2.4142 1.5120 2.3509 1.7249 2.2941 3.4791 2.7970 1.5034 4.6431 1.9515 2.2947 1.1635 1.3150 1.6616 1.6708 2.2869 1.5463 3.4296 1.5838 2.3954 1.6566 4.1782 1.3055 2.1422 1.6686 1.6689 1.9199 1.4382 2.0269 1.3849 1.1858 3.2827 2.9611 1.1131 1.1134 2.1457 1.1608 1.1674 1.1458 1.2651 4.7590 4.5158 7.3404 6.9472 2.6224 1.5908 1.0687 1.0396 1.0566 1.0650 1.0633 1.0974 1.1057 1.0940 1.1057 1.0977 1.0951 1.0905 1.0910 1.0917 1.0948 1.0977 1.0690 1.0450 1.0667 1.1036
irintensity: 1.9576 0.8967 3.1705 0.9825 0.5874 1.7434 5.7824 13.5937 3.7942 3.2247 6.4795 2.2385 0.5494 0.3910 18.8284 68.1979 75.6965 3.6634 3.6077 0.0658 3.1516 0.4274 155.5381 98.7482 26.9615 16.4603 10.6251 4.0379 16.1574 11.8486 10.9881 2.4048 13.4133 0.7286 2.3415 8.0198 12.1052 10.2464 10.2238 1.4322 19.6090 171.7728 2.5162 0.3916 16.9176 7.1698 29.2883 5.1307 3.2596 43.4582 28.5942 48.9583 5.3461 41.5440 12.0542 6.2559 90.0514 47.1398 39.7347 71.1476 43.5158 4.6794 25.2168 64.4279 0.3405 12.7136 0.5006 4.1510 39.6347 69.6399 40.1673 9.1007 3.0803 86.8581 18.5345 46.2776 126.0099 47.0376 6.4153 50.0742 103.1425 120.4967 46.1834 3.8196 12.7302 6.6310 9.7795 8.8145 46.1747 22.0894 104.5196 16.0520 35.0479 8.4978 7.8586 58.3752 14.9048 9.6486 10.2930 31.4786 206.7368 102.7632 712.3030 41.3505 16.0880 289.4076 111.9703 61.3285 44.7374 32.0802 39.4698 27.4486 68.3005 55.4174 46.7113 15.3087 14.4114 31.5580 0.3929 22.9458 3.5925 0.0821 241.8152 65.2180 9.8536 22.7148
temp: 298.150 k
press: 1.00000 atm
elementType: 8 8 7 7 7 7 7 7 6 6 6 6 6 6 6 6 6 6 6 6 6 6 6 6 1 1 1 1 1 1 1 1 1 1 1 1 1 1 1 1 1 1 1 1
symmnumber: 1
zpe: 924687.8 jmol-1
zpe.correction: 0.352195 hartree
zpe.thermalcorrener: 0.374757 hartree
zpe.thermalcorrenthalpy: 0.375701 hartree
zpe.thermalcorrgfe: 0.299127 hartree
zpe.sumelectzpe: -1098.893268 hartree
zpe.sumelectthermal: -1098.870705 hartree
zpe.sumelectthermalent: -1098.869761 hartree
zpe.sumelectthermalfe: -1098.946335 hartree
dipole: -4.6418 -5.2359 -2.6888
dipole: 7.4960
quadrupole: -116.8525 -124.1841 -146.8527
quadrupole: 0.4568 -17.4784 8.1544
quadrupole: 12.4439 5.1124 -17.5563 0.4568 -17.4784 8.1544
hfenergy: -1099.2454625 hartree
pointgroup: C01 [X(C16H20N6O2)]
dipole: -1.9187009 2.0127627 0.9823138 debye
polarizability: 391.2100927|1.2580481|226.5329051|1.0649973|-7.1520661|122.0878533 unknown
InChI: InChI=1S/C16H20N6O2/c1-11-2-3-12(8-13(11)17)22-10-20-14-15(18-9-19-16(14)22)21(4-6-23)5-7-24/h2-3,8-10,23-24H,4-7,17H2,1H3
charge 0 multiplicity 1
44 atoms
O  5.597214 2.079761 0.813147
O  6.37083 0.261863 -1.098117
N  3.432131 -0.003786 0.044989
N  -1.328688 0.205868 -0.207912
N  0.605078 1.390388 -0.567878
N  2.105432 -1.858412 0.672042
N  -0.342939 -1.937851 0.590135
N  -5.907987 1.873312 0.282723
C  2.17876 -0.559456 0.200125
C  0.929407 0.100134 -0.088493
C  3.615312 1.375358 -0.466947
C  4.637797 -0.788444 0.426354
C  -0.264348 -0.654014 0.132769
C  -2.742766 -0.059498 -0.145109
C  -0.733642 1.40954 -0.623899
C  4.159157 2.367624 0.569648
C  5.67943 -0.967188 -0.695734
C  -3.63176 1.020257 0.059346
C  -3.232289 -1.376381 -0.29834
C  -5.034379 0.800268 0.084892
C  -5.549875 -0.527546 -0.078525
C  0.89534 -2.456855 0.835567
C  -4.62824 -1.580682 -0.257708
C  -7.045135 -0.778134 -0.042204
H  2.636297 1.755675 -0.801408
H  4.304012 1.349574 -1.330409
H  4.271469 -1.777623 0.745735
H  5.121544 -0.296297 1.292141
H  -1.322037 2.243858 -0.995045
H  3.593824 2.290913 1.519144
H  4.05126 3.391891 0.158594
H  5.20168 -1.377964 -1.603925
H  6.423541 -1.70974 -0.33223
H  -3.245166 2.031068 0.233685
H  -2.538366 -2.209793 -0.415602
H  0.919955 -3.485398 1.208937
H  -5.014588 -2.600329 -0.373579
H  -7.579026 -0.216118 -0.835675
H  -7.268625 -1.847267 -0.191854
H  -7.490945 -0.483174 0.930025
H  6.002684 2.775508 1.384614
H  6.32296 0.930464 -0.351591
H  -6.910698 1.726813 0.331667
H  -5.553615 2.81661 0.407805
