program: Gaussian 09
title: 000264751
version: EM64L-G09RevD.01
frameworkgroup: C1[X(C23H25NO4)]
method: RPBEPBE
basis: SDD
operation: Freq
keyword: #p
keyword: freq=noraman
keyword: PBEPBE/SDD
title: #p freq=noraman PBEPBE/SDD
converged: YES YES NO NO
title: Mulliken charges:
elementType: O O O O N C C C C C C C C C C C C C C C C C C C C C C C H H H H H H H H H H H H H H H H H H H H H H H H H
charge: -0.445574 -0.296569 -0.295276 -0.264321 -0.118266 -0.084697 -0.504140 -0.323411 -0.382424 -0.440666 -0.479602 0.131952 -0.124982 0.294390 0.392692 0.192918 0.236345 -0.352276 -0.636504 -0.562755 -0.541239 0.195206 -0.428364 0.188873 0.315099 -0.530826 -0.529888 -0.535470 0.244580 0.212120 0.224470 0.221638 0.230800 0.179273 0.228594 0.208990 0.200008 0.241485 0.342898 0.282430 0.269942 0.254816 0.253325 0.239753 0.227736 0.222218 0.256323 0.228462 0.224119 0.252630 0.219287 0.220485 0.243393
chargesum: 0.00000
title: Mulliken charges with hydrogens summed into heavy atoms:
elementType: O O O O N C C C C C C C C C C C C C C C C C C C C C C C
charge: -0.102676 -0.296569 -0.295276 -0.264321 -0.118266 0.159883 -0.067550 -0.101773 0.027649 -0.003083 -0.038109 0.131952 -0.124982 0.294390 0.392692 0.192918 0.236345 -0.069846 -0.366562 -0.307938 -0.287914 0.195206 -0.188611 0.188873 0.315099 0.175451 0.175322 0.147696
polarizability: 3.63999614e+02 2.81556914e+01 3.86045319e+02 -6.37938395e-01 8.84663788e-01 1.49995936e+02
1716.lowfreq: -7.4754 -5.4645 -2.9490 -0.0006 -0.0005 0.0000 32.8735 36.6776 45.5105
frequency: 32.8211 36.6602 45.4919 65.5470 73.7165 76.3185 87.3489 103.7048 105.1786 122.9897 126.9950 155.6658 158.6546 164.9857 181.2086 201.7828 210.9861 237.6944 239.6374 246.3085 248.9712 260.9222 262.4900 270.3214 279.2961 300.8529 318.9525 355.8454 374.3993 402.8862 406.3207 442.4831 457.8111 461.1074 473.1637 485.5572 523.5468 530.0414 567.5304 594.7556 611.1765 619.1963 634.5162 643.8402 657.6205 682.7287 707.5750 716.5622 734.1566 747.6672 773.2257 788.3885 793.3918 832.2191 864.4353 870.8629 885.6345 893.7575 903.2909 903.8401 912.1726 922.1172 942.4158 953.9981 955.6238 961.5605 984.9002 996.8229 1015.9688 1022.9765 1033.3961 1079.4824 1092.0295 1103.8168 1111.0443 1113.1866 1115.0375 1121.7480 1142.6825 1150.6404 1151.0040 1154.0226 1159.4671 1165.9828 1183.3217 1196.6540 1208.0031 1208.4331 1222.8678 1230.7177 1232.1955 1241.0061 1256.3855 1266.1204 1277.6428 1283.1852 1293.8508 1301.5761 1307.0590 1322.8359 1335.3934 1347.5056 1369.9125 1373.1747 1382.4503 1401.9747 1416.0651 1422.1402 1434.9335 1438.9966 1446.7490 1450.8861 1457.1045 1460.7138 1463.8464 1466.4224 1467.0342 1474.6959 1477.5245 1479.7134 1487.3111 1491.2020 1498.0120 1521.3599 1565.7786 1590.4481 1619.6528 1629.8448 2796.2618 2831.1996 2848.5858 2930.0759 2957.7441 2970.1334 2971.7484 2996.4646 3001.8425 3022.4713 3038.8415 3044.8284 3055.6778 3066.8402 3068.6582 3089.5722 3119.8598 3120.0938 3122.0293 3154.6750 3162.3760 3166.2045 3174.5493 3186.9530 3543.0958
redmass: 4.0602 4.3243 3.6585 2.3983 3.2917 3.3632 3.7538 3.8025 2.8348 3.9840 3.9272 2.4773 1.3284 1.1353 2.4738 3.5660 1.7721 3.6116 2.5340 1.8239 3.2332 4.1650 3.7467 1.4160 4.8661 6.6399 4.8953 4.7864 4.8249 3.7351 4.5933 5.7877 3.3672 4.3325 3.5321 4.6923 5.3739 5.0961 4.6459 5.1997 3.7412 4.1756 3.6058 4.4264 4.1218 6.1911 5.0780 5.3374 4.8470 3.1527 2.1341 3.0244 1.5475 2.2968 2.0726 4.2117 1.8147 1.7661 2.6637 3.9450 2.3898 2.7240 1.7291 5.2665 2.5144 4.8785 2.5938 4.1030 3.1170 2.9351 1.8938 2.8047 2.4377 3.5983 1.2582 1.2745 1.2584 1.9929 1.7683 2.0564 1.3787 1.5312 1.6195 1.5981 1.4521 1.5716 1.5563 2.3591 1.3789 1.3609 1.8211 1.9162 1.3942 1.4415 1.4991 2.3847 1.3513 1.4870 1.5073 1.5551 1.4038 2.2784 3.5261 1.8917 3.2885 3.6777 2.5991 1.2539 1.2759 2.7920 2.1707 2.2163 1.0557 1.1862 1.1044 1.0536 1.1427 1.0799 1.0566 1.0941 1.0595 1.1899 2.6892 3.7972 9.2655 8.6328 6.6369 6.6381 1.0712 1.0781 1.0724 1.0834 1.0330 1.0307 1.0310 1.0602 1.0849 1.0657 1.0847 1.1038 1.1032 1.1041 1.1038 1.1055 1.1027 1.1028 1.0992 1.0887 1.0913 1.0906 1.0888 1.0944 1.0660
irintensity: 0.0980 0.3251 3.8502 0.7571 2.7366 1.5279 0.9578 1.7103 8.2863 1.9759 2.2216 1.7965 1.1797 0.0821 5.2190 1.7215 5.9633 4.1731 4.5393 19.7065 4.5790 5.1297 14.3840 74.5310 3.1456 1.9290 5.5478 0.2802 2.6102 14.1864 4.5626 4.4284 2.2030 1.6002 2.8910 4.2826 8.5555 6.0408 17.6262 11.8823 10.7778 3.5819 6.4796 0.3133 5.8833 9.5593 0.8401 19.6529 12.5250 3.0339 2.1637 0.7025 19.9692 20.4753 0.9910 11.9285 4.4680 19.9416 52.3274 31.8991 3.7043 7.6142 6.6052 82.4647 38.9541 58.8955 5.9137 17.4107 53.7269 9.8636 22.9355 28.1221 14.4800 90.1884 0.1931 16.5449 5.5151 6.7019 31.0375 10.9707 2.0874 43.1116 8.8736 59.3592 13.1554 42.3893 41.7111 200.7841 76.1816 1.5513 17.7252 79.8488 4.5962 36.0247 15.9766 44.4330 3.4405 24.0431 8.2979 14.5021 6.8695 27.1875 12.6506 13.9295 2.7596 18.3522 25.7178 2.9440 18.9848 12.5657 3.6623 46.0487 11.9127 11.3026 9.8881 15.0041 14.9936 53.1970 4.4128 18.6256 13.7739 34.1466 173.2629 82.0851 5.8757 19.2100 29.2883 108.4781 57.2430 36.9806 155.1319 51.7013 100.0546 90.2610 84.2921 31.2046 21.2408 42.5956 65.4617 49.9999 8.9020 29.9298 21.1551 55.5083 23.8870 33.1650 29.2993 12.2055 0.8419 6.5516 7.4365 8.1579 4.4278
temp: 298.150 k
press: 1.00000 atm
elementType: 8 8 8 8 7 6 6 6 6 6 6 6 6 6 6 6 6 6 6 6 6 6 6 6 6 6 6 6 1 1 1 1 1 1 1 1 1 1 1 1 1 1 1 1 1 1 1 1 1 1 1 1 1
symmnumber: 1
zpe: 1129039.2 jmol-1
zpe.correction: 0.430028 hartree
zpe.thermalcorrener: 0.455966 hartree
zpe.thermalcorrenthalpy: 0.456911 hartree
zpe.thermalcorrgfe: 0.374531 hartree
zpe.sumelectzpe: -1245.008110 hartree
zpe.sumelectthermal: -1244.982172 hartree
zpe.sumelectthermalent: -1244.981228 hartree
zpe.sumelectthermalfe: -1245.063608 hartree
dipole: 2.6172 -0.7867 -0.1800
dipole: 2.7388
quadrupole: -136.0848 -137.7426 -168.0694
quadrupole: 6.2465 -1.6152 0.4431
quadrupole: 11.2141 9.5563 -20.7705 6.2465 -1.6152 0.4431
hfenergy: -1245.4381387 hartree
pointgroup: C01 [X(C23H25N1O4)]
dipole: 1.0543483 0.2151485 0.0559629 debye
polarizability: 359.0539203|-25.6927726|390.9505056|-1.0710258|-2.9893144|150.0364433 unknown
InChI: InChI=1S/C23H25NO4/c1-26-13-6-7-14-15(9-13)16-10-20(27-2)21(28-3)11-17(16)18-12-24-8-4-5-19(24)23(25)22(14)18/h6-7,9-11,19,23,25H,4-5,8,12H2,1-3H3
charge 0 multiplicity 1
53 atoms
O  3.43211 -1.384803 -1.31208
O  -3.141403 3.657381 -0.071189
O  -4.776936 1.226528 -0.083599
O  -1.608407 -5.07105 0.463067
N  3.148205 1.946973 0.361492
C  3.73269 0.92555 -0.528219
C  5.263077 1.039161 -0.275937
C  3.093557 -0.4360 -0.214591
C  4.05894 3.10946 0.314823
C  5.459798 2.448631 0.3838
C  1.737907 2.196056 0.049989
C  1.570037 -0.348069 -0.098197
C  0.942146 0.895753 -0.027615
C  0.7835 -1.574529 0.004006
C  -0.511653 0.98823 -0.003024
C  -0.65693 -1.509966 0.090594
C  -1.317148 -0.205345 0.029593
C  1.400846 -2.861725 0.068449
C  -1.170632 2.25742 -0.020332
C  -2.73601 -0.072785 -0.006895
C  -1.398437 -2.713317 0.240878
C  -2.563797 2.366012 -0.026985
C  0.659463 -4.039209 0.222347
C  -3.362202 1.176004 -0.054037
C  -0.759509 -3.96086 0.308088
C  -3.991503 3.990108 1.096768
C  -5.339125 1.816335 -1.322025
C  -0.986448 -6.394047 0.537727
H  3.512442 1.152308 -1.604871
H  5.832597 0.947934 -1.217541
H  5.608486 0.241701 0.408391
H  3.517909 -0.8193 0.740958
H  3.863525 3.800434 1.154377
H  3.945784 3.685372 -0.640246
H  5.77099 2.335822 1.436022
H  6.223231 3.054654 -0.133791
H  1.623003 2.76139 -0.915863
H  1.312211 2.836795 0.845641
H  4.41767 -1.369299 -1.42435
H  2.484529 -2.928795 -0.038489
H  -0.603971 3.19204 -0.033083
H  -3.387504 -0.950128 -0.024492
H  -2.487634 -2.705033 0.325669
H  1.178181 -5.001221 0.268309
H  -4.405762 4.987237 0.882933
H  -3.374836 4.026914 2.014977
H  -4.802346 3.249832 1.219329
H  -6.429657 1.827561 -1.173128
H  -5.083978 1.182471 -2.192447
H  -4.957521 2.841392 -1.479631
H  -0.306969 -6.473694 1.408844
H  -0.429111 -6.632221 -0.38934
H  -1.823405 -7.097969 0.656727
