program: Gaussian 09
title: 000264749
version: EM64L-G09RevD.01
frameworkgroup: C1[X(C13H17N3O7S)]
method: RPBEPBE
basis: SDD
operation: Freq
keyword: #p
keyword: freq=noraman
keyword: PBEPBE/SDD
title: #p freq=noraman PBEPBE/SDD
converged: YES YES NO NO
title: Mulliken charges:
elementType: S O O O O O O O N N N C C C C C C C C C C C C C H H H H H H H H H H H H H H H H H
charge: 0.135634 -0.193953 -0.445986 -0.437927 -0.188857 -0.256417 -0.210244 -0.203680 -0.361714 0.024015 0.016369 -0.196778 -0.152229 -0.071938 -0.446780 -0.333839 0.311606 -0.567019 0.227414 -0.311662 -0.641949 -0.502991 -0.418147 0.445318 0.292689 0.244515 0.261890 0.291257 0.376671 0.198050 0.238471 0.369812 0.271883 0.241691 0.291929 0.359086 0.229708 0.257201 0.223016 0.337919 0.295969
chargesum: 0.00000
title: Mulliken charges with hydrogens summed into heavy atoms:
elementType: S O O O O O O O N N N C C C C C C C C C C C C C
charge: 0.135634 -0.193953 -0.076174 -0.078841 -0.188857 -0.256417 -0.210244 -0.203680 0.014957 0.024015 0.016369 0.095911 0.092286 0.189952 -0.155523 0.102682 0.311606 -0.053446 0.227414 -0.019734 0.067975 -0.165072 -0.122178 0.445318
polarizability: 3.28947227e+02 1.66201431e+01 2.61516122e+02 3.49231948e+00 -2.01425883e+01 1.25407591e+02
1716.lowfreq: -20.9360 -6.5465 -4.1545 0.0008 0.0021 0.0022 6.7989 20.7750 22.4022
frequency: -20.5791 20.3456 22.2503 29.9406 31.4099 57.0279 62.4653 69.2356 80.0364 90.3976 116.1465 143.0420 161.6458 168.1374 175.8367 176.9036 194.6338 250.4971 253.9046 274.3713 304.7243 315.7242 318.2769 328.3856 353.2970 361.3039 378.8406 387.0661 416.8402 447.6771 453.6254 474.7706 498.5681 518.3935 531.0442 566.3096 599.1418 610.6460 631.6438 641.4822 655.7056 678.0992 705.6969 730.8172 733.3014 755.0979 778.3608 809.7879 839.0151 864.5992 876.1678 886.7402 890.5722 956.7388 968.3995 975.2998 984.9821 989.4320 997.7760 1021.3146 1037.0315 1043.2987 1049.2410 1060.0204 1070.8047 1103.3267 1116.8725 1129.3579 1146.3079 1158.8195 1175.5692 1200.2703 1215.1037 1230.2896 1238.1728 1242.6896 1249.9598 1255.7550 1263.0271 1275.3129 1289.9655 1297.7735 1311.8362 1344.4315 1345.5668 1359.5264 1364.5223 1381.7373 1388.0040 1400.5768 1403.9518 1449.5026 1452.2427 1467.3105 1469.5111 1485.0647 1485.3041 1518.9433 1573.5135 1626.0964 2970.4756 2979.0789 2985.8038 3010.7419 3019.9069 3020.7189 3079.0890 3084.2642 3086.1683 3092.5418 3111.7670 3160.8826 3184.6673 3186.6431 3227.9103 3509.2058 3562.0044
redmass: 2.3496 3.2124 7.4499 6.2370 7.2778 12.6880 6.3796 9.4262 7.0582 5.7923 5.1567 12.1637 4.8267 4.1286 9.3493 4.2720 5.5084 4.2107 1.3132 3.5237 5.4740 7.2884 1.8331 1.9752 7.1592 8.5476 6.1579 8.5326 1.4862 2.7100 3.1832 3.3376 9.6376 3.6385 5.1693 5.9230 6.0727 5.2443 5.9188 6.3346 7.7337 9.2405 7.4946 4.9805 5.2522 12.4408 1.1658 5.2841 1.4380 1.1292 2.2325 3.4980 5.4782 5.3729 1.4106 6.5818 2.8426 2.1842 1.3964 3.4411 1.2228 3.8783 2.3109 1.9496 2.2909 3.0142 3.1827 2.1733 1.1767 2.1174 4.5061 1.3588 6.4481 1.2842 1.2507 1.4088 1.2699 1.3062 1.2298 1.3274 1.2995 1.3317 1.6144 2.3296 1.8375 1.5618 5.7952 1.3020 2.9916 1.1970 1.4483 3.5309 1.1205 2.3211 1.1174 1.0478 1.0898 4.1538 6.4804 7.1412 1.0697 1.0843 1.0361 1.0842 1.0800 1.0628 1.0979 1.0891 1.1031 1.0966 1.1058 1.0893 1.0951 1.0930 1.0785 1.0669 1.0665
irintensity: 0.1105 2.2340 0.2220 0.4765 5.7532 0.6285 1.3633 2.7501 0.8617 4.8518 5.8820 0.7667 1.7282 0.8539 7.1295 1.5754 0.7326 2.3531 1.5517 5.6318 7.1854 0.4974 17.5528 19.2617 2.0224 3.4465 28.5770 2.7916 213.6463 63.8132 34.5754 4.2314 7.9753 2.7348 23.0512 13.0650 35.1121 6.6519 22.1431 11.7192 9.5162 8.6758 8.7573 7.5449 8.2423 15.1545 16.7159 0.8040 56.2871 31.1252 9.0107 26.6968 8.1196 46.8003 22.7515 293.8696 39.2155 9.8622 2.4929 22.4515 0.7381 56.0849 10.6650 19.3829 14.8295 60.4511 5.8835 3.7168 13.1142 126.4900 334.9029 10.8937 447.4379 36.1940 4.3638 1.9811 8.3305 67.3785 17.0480 45.1640 39.7957 6.1404 63.6190 59.9297 115.6247 11.5711 59.6644 24.0845 47.1766 20.9280 4.1526 18.4673 4.5515 7.2067 12.8241 8.8149 3.9847 207.9040 139.1948 411.9863 33.2269 16.1250 26.5431 5.8820 32.8201 27.4778 27.2181 9.3438 0.0838 24.6891 37.9225 0.1692 4.1756 19.1327 223.4350 18.2390 11.1263
temp: 298.150 k
press: 1.00000 atm
elementType: 16 8 8 8 8 8 8 8 7 7 7 6 6 6 6 6 6 6 6 6 6 6 6 6 1 1 1 1 1 1 1 1 1 1 1 1 1 1 1 1 1
symmnumber: 1
zpe: 798880.4 jmol-1
zpe.correction: 0.304277 hartree
zpe.thermalcorrener: 0.327770 hartree
zpe.thermalcorrenthalpy: 0.328714 hartree
zpe.thermalcorrgfe: 0.248251 hartree
zpe.sumelectzpe: -1592.459427 hartree
zpe.sumelectthermal: -1592.435934 hartree
zpe.sumelectthermalent: -1592.434990 hartree
zpe.sumelectthermalfe: -1592.515453 hartree
dipole: 4.3145 0.4992 1.6456
dipole: 4.6446
quadrupole: -204.0735 -161.9431 -144.4858
quadrupole: 16.7250 4.4648 7.2406
quadrupole: -33.9060 8.2244 25.6817 16.7250 4.4648 7.2406
hfenergy: -1592.7637041 hartree
pointgroup: C01 [X(C13H17N3O7S1)]
dipole: -1.7161522 0.4462979 -0.441354 debye
polarizability: 326.240574|-17.1175761|243.1346711|-12.3171935|53.918941|146.4956947 unknown
InChI: InChI=1S/C13H17N3O7S/c1-2-24-13-11(12(18)10(6-17)23-13)14-8-4-3-7(15(19)20)5-9(8)16(21)22/h3-5,10-14,17-18H,2,6H2,1H3
charge 0 multiplicity 1
41 atoms
S  -2.895058 1.61825 0.583945
O  -3.70456 -0.228963 -1.398218
O  -1.335337 -2.765548 -0.311882
O  -4.333198 -3.56634 0.250829
O  2.967343 2.709193 1.233174
O  0.719275 2.366996 1.118197
O  5.445896 -2.152854 -1.833431
O  6.141538 -0.347914 -0.614476
N  -0.230502 0.358913 -0.288143
N  1.953172 2.018022 0.84287
N  5.217869 -1.089948 -1.1301
C  -1.375094 -0.275476 -0.926548
C  -2.026648 -1.479916 -0.180832
C  -3.395272 -1.602569 -0.888666
C  -2.608427 0.666007 -1.051423
C  -4.520557 -2.12879 0.011756
C  1.081845 0.016372 -0.483231
C  -3.118807 3.406713 -0.048043
C  2.176972 0.798157 0.061431
C  1.445847 -1.150331 -1.247334
C  -2.573574 4.387238 0.999239
C  3.522728 0.433643 -0.153233
C  2.774647 -1.50476 -1.463067
C  3.813256 -0.707602 -0.909075
H  -1.113139 -0.614628 -1.947777
H  -2.153469 -1.211909 0.889805
H  -3.287007 -2.272201 -1.763992
H  -2.513701 1.418712 -1.849101
H  -0.415935 1.174295 0.330329
H  -4.5528 -1.557084 0.962675
H  -5.493502 -2.028885 -0.494675
H  -0.575671 -2.807978 0.323042
H  -4.192506 3.556905 -0.243614
H  -2.559839 3.486365 -0.996801
H  0.65316 -1.782015 -1.656685
H  -3.363622 -3.757712 0.357065
H  -3.106401 4.289641 1.961544
H  -1.497964 4.217915 1.180099
H  -2.710526 5.425862 0.643753
H  4.324584 1.046178 0.267164
H  3.040185 -2.39225 -2.043772
