program: Gaussian 09
title: 000264745
version: EM64L-G09RevD.01
frameworkgroup: C1[X(C18H21N5O9)]
method: RPBEPBE
basis: SDD
operation: Freq
keyword: #p
keyword: freq=noraman
keyword: PBEPBE/SDD
title: #p freq=noraman PBEPBE/SDD
converged: YES YES NO NO
title: Mulliken charges:
elementType: O O O O O O O O O N N N N N C C C C C C C C C C C C C C C C C C H H H H H H H H H H H H H H H H H H H H H
charge: -0.211298 -0.291450 -0.291133 -0.257872 -0.268338 -0.199139 -0.236415 -0.221988 -0.255481 -0.183432 -0.079785 -0.047687 -0.062391 -0.610488 -0.188321 -0.037133 -0.139487 -0.104255 -0.093065 0.189094 0.185589 -0.197864 -0.113439 0.333911 0.330258 0.336550 0.169158 -0.760786 -0.775911 -0.759613 -0.367938 -0.505445 0.343203 0.371949 0.303015 0.220891 0.255795 0.263704 0.251748 0.252465 0.252512 0.245852 0.248085 0.266586 0.257930 0.241521 0.272614 0.246905 0.266524 0.245043 0.231623 0.333466 0.344166
chargesum: 0.00000
title: Mulliken charges with hydrogens summed into heavy atoms:
elementType: O O O O O O O O O N N N N N C C C C C C C C C C C C C C C C C C
charge: -0.211298 -0.291450 -0.291133 -0.257872 -0.268338 -0.199139 -0.236415 -0.221988 -0.255481 -0.183432 -0.079785 -0.047687 -0.062391 0.067144 0.154882 0.334817 0.163527 0.116636 0.162730 0.189094 0.185589 0.065840 -0.113439 0.333911 0.330258 0.336550 0.169158 -0.004062 -0.015388 0.012452 -0.121032 0.237745
polarizability: 2.96521635e+02 1.24133654e+01 2.31650377e+02 -1.26410811e+01 -1.17125156e+01 2.43559211e+02
1716.lowfreq: -10.4492 -5.3734 -3.5796 0.0004 0.0007 0.0007 14.3526 25.7958 30.5061
frequency: 14.3359 25.7750 30.4972 36.6791 47.1127 51.1538 51.8349 59.0434 62.0794 66.1039 70.9772 77.0335 85.8801 92.0185 96.3237 104.4972 110.6110 113.7665 134.1591 144.0453 162.1324 184.1156 195.0892 199.5994 206.4488 218.4875 226.7363 233.5097 252.6505 254.4410 271.8787 283.5926 300.7750 337.4209 367.9908 392.2507 416.0326 430.9002 475.7316 498.1496 511.1662 514.7134 531.4988 537.2681 546.6770 552.1915 557.5841 560.4549 568.6464 588.2317 594.9236 621.9470 632.1591 641.0618 650.8685 658.1434 674.5286 702.3087 717.4721 731.3162 788.8419 790.8606 818.3004 820.1767 826.8643 847.6395 869.0462 878.3618 891.4946 910.0916 931.5937 953.2209 959.8721 969.9820 975.1356 989.3571 993.7631 997.2893 1007.3965 1015.2370 1025.5123 1038.0721 1042.6207 1044.4028 1044.7314 1095.4773 1115.0938 1131.7223 1146.5851 1153.7018 1166.9572 1176.2404 1183.1111 1186.7748 1199.2321 1228.9223 1240.6038 1259.2196 1267.7601 1276.0968 1284.5562 1303.3662 1310.3795 1315.1311 1324.2274 1333.3499 1338.3266 1361.6077 1368.9537 1381.7765 1384.6634 1385.7107 1394.2178 1401.0059 1420.0272 1438.3336 1450.9367 1452.3853 1452.5542 1453.0267 1454.1935 1455.7088 1456.4592 1465.8401 1467.8541 1545.6979 1579.5198 1632.7199 1655.4385 1666.9380 1669.2010 1673.7678 2977.3366 2992.1733 3004.9925 3007.0842 3007.9962 3008.4808 3048.6762 3053.2430 3074.6192 3099.6849 3100.4713 3101.7313 3116.7860 3140.9043 3143.2246 3144.8941 3153.5970 3168.1995 3228.8341 3540.5184 3695.7860
redmass: 6.4208 5.9140 5.8828 5.3937 5.3086 1.5913 2.7627 3.2176 2.6407 6.3243 4.6871 5.4287 3.9684 1.2056 1.7904 1.9632 5.1788 1.0459 5.9721 5.6195 7.6670 8.0095 6.7460 7.0689 7.9044 5.3604 5.2625 5.4255 4.8803 4.8315 5.7171 5.2573 5.7957 6.5134 5.0394 3.9111 4.4624 4.8972 4.0720 5.2963 8.2072 1.2476 4.8387 4.5700 1.0533 3.4145 3.3550 3.2809 4.3311 5.6800 5.5376 5.9895 4.8751 5.4825 5.8864 5.5160 7.0780 7.1928 5.3176 6.3775 6.0371 3.5330 4.8665 2.4273 4.7624 7.5186 6.9197 6.7580 6.2287 4.9054 1.4365 7.9810 2.6446 3.8663 3.6835 2.3470 1.9121 2.1619 4.1269 4.3823 4.9691 4.1599 1.6722 1.6570 1.6556 2.6169 1.4772 2.3112 2.6558 1.4510 4.5109 3.2580 2.2057 3.3591 3.3849 1.7990 1.8022 1.7014 1.4073 1.2678 1.6837 5.1301 1.9705 4.7028 1.3070 1.3823 1.4676 1.4939 1.6012 1.2510 1.2364 1.2415 5.4727 1.8039 1.1876 2.9090 1.0537 1.0552 1.0551 1.0524 1.0550 1.0522 1.0533 4.2195 1.0543 6.5167 1.8905 2.8071 9.9053 9.9873 10.1523 10.3670 1.0838 1.0825 1.0381 1.0382 1.0381 1.0290 1.0847 1.0854 1.0870 1.0948 1.0944 1.0943 1.1054 1.1022 1.1020 1.1025 1.1052 1.0921 1.0986 1.0442 1.1056
irintensity: 0.1458 0.1506 1.2213 0.7032 0.7762 1.2302 3.1926 0.7446 2.2844 0.5102 2.4118 7.0293 3.6167 0.6839 0.2440 0.7018 3.6041 0.2742 1.9460 3.3098 3.5112 5.1311 1.7022 2.5988 6.0897 9.1651 6.3746 1.1415 2.5293 8.5886 7.7034 8.2747 9.9923 5.2913 11.7906 6.0499 9.1385 4.4848 19.1445 9.8795 8.5622 267.3932 2.9593 7.9456 1.0121 4.2603 4.7507 1.5988 2.1192 19.6190 1.5393 17.9624 7.2966 17.7765 51.6512 4.7146 1.3628 5.1007 18.6499 3.7172 20.7617 15.7797 19.3157 8.4738 12.9417 10.6308 42.1395 44.8957 66.4188 60.3547 9.2513 64.5586 11.7795 37.3631 45.5841 20.6351 42.1555 9.2007 121.1164 252.0114 92.4892 93.6822 19.5742 15.9772 12.0964 67.7059 15.5392 113.2793 42.7084 13.1843 23.9794 113.1445 54.9863 656.1853 278.9841 2.0281 120.1231 30.4747 24.0030 4.3330 19.4209 49.1051 5.1370 63.4518 46.6173 7.2601 8.4540 33.7512 30.6161 67.5294 86.5625 26.6405 14.6405 89.4453 27.2097 62.3385 20.5220 20.6055 23.2664 14.1387 13.1124 23.8794 10.1401 59.4730 6.9295 49.6910 31.3145 653.9236 223.6844 157.5762 107.7363 150.6010 27.3401 16.8675 1.3727 1.1669 0.5037 31.4624 23.4433 7.0289 3.3829 7.4816 5.7393 4.7869 14.3473 7.0158 7.4760 8.5808 14.4355 12.0957 0.0278 134.9601 48.9957
temp: 298.150 k
press: 1.00000 atm
elementType: 8 8 8 8 8 8 8 8 8 7 7 7 7 7 6 6 6 6 6 6 6 6 6 6 6 6 6 6 6 6 6 6 1 1 1 1 1 1 1 1 1 1 1 1 1 1 1 1 1 1 1 1 1
symmnumber: 1
zpe: 1033690.1 jmol-1
zpe.correction: 0.393712 hartree
zpe.thermalcorrener: 0.426060 hartree
zpe.thermalcorrenthalpy: 0.427004 hartree
zpe.thermalcorrgfe: 0.326131 hartree
zpe.sumelectzpe: -1646.927911 hartree
zpe.sumelectthermal: -1646.895563 hartree
zpe.sumelectthermalent: -1646.894619 hartree
zpe.sumelectthermalfe: -1646.995491 hartree
dipole: 0.9396 2.0346 -4.2783
dipole: 4.8297
quadrupole: -162.9008 -180.6799 -178.0083
quadrupole: -1.2548 -1.6406 -13.0492
quadrupole: 10.9622 -6.8169 -4.1453 -1.2548 -1.6406 -13.0492
hfenergy: -1647.3216225 hartree
pointgroup: C01 [X(C18H21N5O9)]
dipole: -0.5250709 0.570737 1.7346866 debye
polarizability: 294.6804291|12.727798|231.095063|-18.5939566|5.4332525|245.9557309 unknown
InChI: InChI=1S/C18H21N5O9/c1-7(24)29-11-12(30-8(2)25)14(18(27)28-4)32-17(13(11)31-9(3)26)23-6-22-10-15(19)20-5-21-16(10)23/h5-6,11-14,17H,19H2,1-4H3
charge 0 multiplicity 1
53 atoms
O  -0.084321 -1.205702 0.926043
O  -2.428317 1.366253 1.07684
O  0.020708 2.400755 -0.036699
O  -1.813428 -1.195225 -1.490798
O  -3.014979 -3.132445 1.624354
O  -1.132498 -3.779854 0.396844
O  -2.941818 3.387912 0.014625
O  -0.341849 2.694969 -2.326144
O  -3.5857 -2.715197 -1.514609
N  1.726807 0.294131 1.044601
N  3.815374 0.251912 2.004082
N  2.402999 0.211064 -1.362874
N  4.847375 0.127331 -1.627781
N  6.335552 0.121391 0.208622
C  -1.869022 0.81217 -0.192304
C  -0.337034 0.976187 -0.198506
C  -2.261881 -0.675505 -0.180081
C  0.280942 0.231789 1.002175
C  -1.537534 -1.399654 0.989807
C  -1.814021 -2.902305 0.958225
C  2.643763 0.230183 -0.020742
C  2.495488 0.296009 2.226294
C  3.92211 0.210553 0.598302
C  -2.922016 2.688998 1.04695
C  -0.034111 3.179732 -1.220984
C  -2.555518 -2.2557 -2.053535
C  5.053058 0.152402 -0.267851
C  -3.386804 3.096022 2.425685
C  0.284554 4.620012 -0.910237
C  -1.90123 -2.722613 -3.326806
C  3.559754 0.159896 -2.088811
C  -3.588374 -4.492689 1.458266
H  -2.310578 1.340603 -1.053709
H  0.072136 0.586306 -1.148137
H  -3.354193 -0.80388 -0.073623
H  -0.113559 0.661024 1.947565
H  -1.952787 -0.979076 1.928779
H  2.02666 0.326299 3.20796
H  -3.905641 2.264507 2.928474
H  -4.048254 3.971207 2.349083
H  -2.510659 3.368089 3.042375
H  1.040405 4.698045 -0.113367
H  0.630311 5.129424 -1.821965
H  -0.641261 5.113509 -0.560899
H  -1.492838 -1.872302 -3.895024
H  -2.622996 -3.287984 -3.934161
H  -1.056257 -3.385289 -3.063976
H  3.444053 0.143706 -3.176358
H  -3.882613 -4.626045 0.404052
H  -2.848332 -5.257543 1.745581
H  -4.463524 -4.512069 2.122059
H  7.106463 0.073116 -0.454203
H  6.504633 0.12987 1.21214
