program: Gaussian 09
title: 000264743
version: EM64L-G09RevD.01
frameworkgroup: C1[X(C19H20O7)]
method: RPBEPBE
basis: SDD
operation: Freq
keyword: #pfreq=noraman
keyword: PBEPBE/SDD
title: #p freq=noraman PBEPBE/SDD
converged: YES YES NO NO
title: Mulliken charges:
elementType: O O O O O O O C C C C C C C C C C C C C C C C C C C H H H H H H H H H H H H H H H H H H H H
charge: -0.265762 -0.198862 -0.221401 -0.291189 -0.194708 -0.192358 -0.218941 0.409240 -0.169784 -0.167862 -0.533317 -0.261926 -0.773853 -0.051157 -0.138776 0.344556 -0.621267 -0.349296 0.276646 0.104524 0.074640 -0.692088 0.192980 0.348398 -0.763981 -0.623975 0.237095 0.256083 0.263889 0.251973 0.237383 0.239430 0.217146 0.245372 0.297105 0.264358 0.238886 0.262461 0.281008 0.236274 0.261931 0.231394 0.242609 0.221736 0.231762 0.261628
chargesum: 0.00000
title: Mulliken charges with hydrogens summed into heavy atoms:
elementType: O O O O O O O C C C C C C C C C C C C C C C C C C C
charge: -0.265762 -0.198862 -0.221401 -0.291189 -0.194708 -0.192358 -0.218941 0.409240 0.067310 0.088221 -0.017454 -0.024543 -0.071906 0.245948 0.125581 0.344556 -0.119920 -0.068288 0.276646 0.104524 0.074640 -0.193884 0.192980 0.348398 -0.068243 -0.130585
polarizability: 2.87838902e+02 5.35454651e+00 1.93092294e+02 -6.86155315e+00 4.69495737e-01 1.77342034e+02
1716.lowfreq: -9.7592 -5.5176 -0.0006 -0.0002 0.0007 4.8442 18.6474 30.2548 42.5170
frequency: 17.9755 30.2224 42.5049 45.6685 59.8044 81.7201 89.6976 98.8620 101.3477 128.0466 146.4837 161.7312 170.2138 176.8202 182.9003 200.8840 228.1921 253.2889 255.4074 280.3997 291.2288 296.0212 329.0039 338.4906 353.4474 377.9960 384.8562 397.4161 401.6630 446.2320 453.8246 469.6361 494.1004 504.6666 531.2756 556.7399 566.0028 596.4400 611.7068 627.3321 636.1316 662.8610 706.4327 716.6580 727.1455 741.9419 758.0211 759.8940 778.7352 780.6115 781.6366 810.6841 834.4589 856.2908 870.6623 884.3208 908.8062 932.5385 945.7017 950.8026 957.9455 976.2583 981.7280 986.2910 996.8910 999.1414 1007.0753 1008.2237 1018.7215 1035.3727 1044.6087 1052.4543 1061.7840 1067.4907 1071.3130 1086.8630 1102.4317 1155.4959 1165.1279 1205.9404 1224.7176 1234.2953 1243.8649 1255.8383 1269.5079 1273.1163 1280.7988 1288.1066 1293.8485 1305.1487 1316.5130 1327.2189 1332.2159 1336.1974 1370.4897 1394.9972 1400.3374 1416.3759 1416.9847 1419.3071 1456.9146 1458.2364 1461.8360 1466.8485 1471.7227 1477.7183 1619.3735 1653.0676 1659.8644 1670.8526 1693.9332 1698.6881 2980.2681 2989.1406 3012.0780 3015.7431 3022.3157 3034.3882 3048.7978 3051.3388 3067.7106 3071.1194 3081.8969 3086.2441 3093.1587 3098.0325 3098.7620 3100.9223 3105.9186 3185.4664 3212.2266 3218.4063
redmass: 5.4987 4.9951 4.4682 7.0354 4.7329 6.0316 5.8049 6.9019 4.5655 4.8952 4.1072 3.4802 1.1030 1.5584 2.3932 4.7990 4.1661 3.3912 4.9487 3.8959 3.7905 5.3449 4.0218 3.9219 4.5744 3.0875 3.2559 4.6480 4.1799 4.3687 4.4888 4.0820 3.9917 4.2901 5.7102 3.0492 3.6944 3.8108 6.4810 1.6226 6.7497 2.3807 4.2695 4.7994 5.8070 7.2350 3.8847 5.1354 2.0439 2.7055 3.2513 6.3029 3.0274 2.4535 1.6182 3.1271 4.1178 2.5118 2.1959 2.8834 3.0678 3.7904 1.7680 2.0057 1.3183 2.5020 1.4263 3.6585 2.5147 2.4740 2.1292 1.5158 2.2927 2.1953 1.9310 3.6318 2.3658 1.4084 1.5027 1.9278 1.9890 1.5171 1.3381 1.9224 1.6537 1.6343 1.3367 2.5049 1.4260 1.4037 1.4735 1.5027 1.8063 1.7990 1.2453 1.1743 1.2401 1.5855 1.3578 1.2935 1.0563 1.0898 1.0858 1.0929 1.0595 1.0745 10.6677 5.3336 8.2509 6.5986 12.6330 12.2182 1.0380 1.0363 1.0622 1.0827 1.0620 1.0850 1.0879 1.0866 1.0969 1.0970 1.1028 1.0973 1.0914 1.0995 1.1005 1.0618 1.0621 1.0978 1.1157 1.1158
irintensity: 1.1512 0.3364 1.4880 1.8742 0.5317 1.1639 4.4093 0.8034 0.2103 3.7748 0.3899 2.8978 0.2664 0.9669 3.8876 0.3381 1.2133 2.9631 2.1074 0.6201 8.9961 3.6914 5.4397 4.5402 1.8118 0.4352 1.4031 2.4233 6.2415 6.1990 4.7812 5.3715 3.4515 8.4350 8.7404 10.3993 3.9615 0.9525 4.5490 8.2145 5.8946 16.3559 8.0537 2.7943 1.5586 7.9701 5.2733 6.8215 11.6460 9.0907 14.5201 24.9919 21.2335 2.6681 19.0520 0.6572 80.7329 6.7044 15.5269 15.9691 51.9168 120.0696 59.3540 32.8782 44.2993 6.0487 31.6570 52.4942 90.2805 95.2724 43.0846 4.2352 23.7029 53.8013 11.6765 373.0735 2.4727 2.2249 9.0700 19.8873 83.3055 7.0606 0.4269 7.5819 12.4119 11.3476 9.4419 53.4196 20.4879 3.9063 10.0344 4.8203 7.5697 14.9897 1.8860 25.8150 28.4740 12.1322 18.3526 13.1460 17.5253 9.4778 3.7754 14.7812 38.9096 16.5668 99.4388 3.9037 13.8229 14.7224 311.8466 262.8621 18.8054 16.6338 9.7377 20.7443 10.7551 6.5611 11.4033 11.2449 21.8027 17.8598 2.9818 23.3547 16.6561 21.7121 27.3333 3.5927 4.8138 4.9109 1.7654 4.6733
temp: 298.150 k
press: 1.00000 atm
elementType: 8 8 8 8 8 8 8 6 6 6 6 6 6 6 6 6 6 6 6 6 6 6 6 6 6 6 1 1 1 1 1 1 1 1 1 1 1 1 1 1 1 1 1 1 1 1
symmnumber: 1
zpe: 930506.9 jmol-1
zpe.correction: 0.354411 hartree
zpe.thermalcorrener: 0.378786 hartree
zpe.thermalcorrenthalpy: 0.379730 hartree
zpe.thermalcorrgfe: 0.299701 hartree
zpe.sumelectzpe: -1260.585055 hartree
zpe.sumelectthermal: -1260.560680 hartree
zpe.sumelectthermalent: -1260.559736 hartree
zpe.sumelectthermalfe: -1260.639766 hartree
dipole: -0.7132 -2.0964 9.7972
dipole: 10.0444
quadrupole: -124.2921 -185.0715 -156.6784
quadrupole: -8.8454 -3.4713 3.0108
quadrupole: 31.0552 -29.7242 -1.3311 -8.8454 -3.4713 3.0108
hfenergy: -1260.9394663 hartree
pointgroup: C01 [X(C19H20O7)]
dipole: 0.1394947 -0.4627997 -3.9220849 debye
polarizability: 283.0018909|-20.8173119|197.6053626|-8.7344493|2.7891466|177.6659771 unknown
InChI: InChI=1S/C19H20O7/c1-8(2)16(20)24-12-6-10-5-11(23-18(10)22)7-19(4)15(26-19)14-13(12)9(3)17(21)25-14/h5,11-15H,1,3,6-7H2,2,4H3
charge 0 multiplicity 1
46 atoms
O  3.45083 1.652909 0.670344
O  0.553959 1.894764 1.422557
O  2.757214 -3.083553 0.391277
O  -2.433732 -0.47335 -0.692695
O  -1.009318 3.625623 1.423938
O  0.637965 -3.843134 1.060527
O  -3.015368 0.14774 1.48481
C  3.573962 0.54352 -0.355448
C  2.278126 1.321466 -0.212666
C  1.003438 0.833068 0.466819
C  3.757134 -0.83151 0.290876
C  -0.18385 0.641106 -0.551719
C  4.496397 0.870806 -1.519968
C  -1.030157 -0.650829 -0.24785
C  3.240697 -2.036205 -0.560067
C  -0.952525 1.942672 -0.397986
C  -0.551189 -1.901006 -1.039077
C  2.007186 -1.662427 -1.352687
C  0.897547 -2.199456 -0.77971
C  -0.539272 2.616871 0.876418
C  1.328431 -3.124124 0.319998
C  -1.86204 2.497006 -1.235545
C  -3.359795 -0.066909 0.300198
C  -4.740811 0.038143 -0.268833
C  -4.971257 -0.321448 -1.722078
C  -5.724335 0.456468 0.575506
H  2.092882 2.10316 -0.967683
H  1.183335 -0.052728 1.093766
H  3.215172 -0.854984 1.25116
H  4.82606 -0.974407 0.530097
H  0.209215 0.552379 -1.581487
H  5.551928 0.788723 -1.203536
H  4.343779 0.17609 -2.368081
H  4.330586 1.900159 -1.879321
H  -1.039748 -0.834923 0.842849
H  4.041071 -2.499985 -1.161426
H  -0.731361 -1.712912 -2.113083
H  -1.174555 -2.757335 -0.72775
H  2.039197 -0.98067 -2.204176
H  -2.161319 2.018439 -2.173252
H  -2.325322 3.454941 -0.971616
H  -4.369462 0.319278 -2.391791
H  -4.66808 -1.363713 -1.927094
H  -6.035269 -0.204459 -1.987732
H  -6.76113 0.55652 0.236997
H  -5.496218 0.703213 1.618118
