program: Gaussian 09
title: 000264725
version: EM64L-G09RevD.01
frameworkgroup: C1[X(C18H24Cl2N2O2S)]
method: RPBEPBE
basis: SDD
operation: Freq
keyword: #p
keyword: freq=noraman
keyword: PBEPBE/SDD
title: #p freq=noraman PBEPBE/SDD
converged: YES YES NO NO
title: Mulliken charges:
elementType: Cl Cl S O O N N C C C C C C C C C C C C C C C C C C H H H H H H H H H H H H H H H H H H H H H H H H
charge: 0.002123 0.005040 0.838295 -0.533293 -0.543347 -0.118365 -0.394405 -0.187995 -0.043895 -0.508692 -0.459580 -0.410490 0.283559 -0.750653 -0.389146 -0.393343 -0.393250 -0.377103 -0.408161 0.024589 -0.229115 -0.255410 -0.047438 -0.175680 -0.088839 0.217143 0.246704 0.223050 0.260636 0.211824 0.209739 0.211312 0.215202 0.196517 0.230782 0.223069 0.252489 0.268432 0.230917 0.226720 0.217998 0.207369 0.207142 0.206051 0.226500 0.198900 0.310063 0.288660 0.267374
chargesum: 0.00000
title: Mulliken charges with hydrogens summed into heavy atoms:
elementType: Cl Cl S O O N N C C C C C C C C C C C C C C C C C C
charge: 0.002123 0.005040 0.838295 -0.533293 -0.543347 -0.118365 -0.394405 0.029148 0.202809 -0.025006 -0.038017 0.016024 0.283559 -0.100286 0.131774 0.064295 0.032118 0.036090 0.017239 0.024589 0.080947 0.033250 -0.047438 0.091694 -0.088839
polarizability: 3.53156854e+02 -2.16616983e+01 2.30024556e+02 -1.13474639e+01 -1.06985782e+01 2.19490209e+02
1716.lowfreq: -3.9500 -2.1151 -0.0021 -0.0012 0.0001 5.2339 12.8038 21.8139 24.4592
frequency: 12.6903 21.7056 24.3863 39.5530 44.2414 48.7150 67.5287 69.6872 85.4053 108.1726 119.2653 123.0986 160.4872 167.3145 171.1798 182.6308 187.1803 220.7933 235.6424 249.3246 253.9734 270.8889 290.4348 300.5346 320.7201 326.0165 359.9159 375.8063 390.9582 411.4913 422.7972 432.8538 442.0786 448.0832 452.9160 495.6249 518.9322 526.5200 552.6407 566.5879 610.1693 650.5261 653.6431 671.7436 699.9437 746.2506 756.0407 784.0979 791.1516 799.9816 808.8582 826.7850 847.2036 850.9991 879.5279 894.1381 894.4944 906.8122 913.8452 924.4364 947.4708 962.1566 965.7541 973.7738 993.7676 1000.1456 1022.1022 1042.3890 1050.8095 1062.1504 1068.0664 1093.7841 1114.3472 1115.3475 1118.9002 1133.4831 1134.3255 1146.1799 1153.7213 1165.2259 1187.2853 1204.8089 1224.8906 1236.5973 1237.4871 1253.0406 1261.5648 1268.9790 1277.9025 1289.4594 1292.2439 1297.3326 1315.1950 1335.1325 1340.1723 1344.2475 1345.8150 1349.7129 1360.8722 1361.8002 1373.8870 1386.3516 1402.5678 1432.7715 1458.0884 1466.6138 1467.8781 1470.8039 1472.2312 1473.8910 1477.0089 1481.3585 1488.0973 1489.1808 1519.1703 1565.2780 1585.2860 2961.3445 2962.9623 2977.0384 2981.3764 2986.3866 2986.9468 2988.2851 2992.9379 3002.9762 3005.4495 3018.7700 3042.7612 3043.0955 3050.1537 3055.5439 3058.4761 3064.7765 3066.3195 3079.4131 3088.3841 3110.1318 3161.0298 3167.8091 3178.4726
redmass: 8.2500 5.8734 6.3959 3.0416 2.4942 3.0045 4.2166 4.1223 3.4540 5.8928 5.3705 6.9141 4.0208 6.5858 4.3040 4.8445 7.2909 12.2373 4.2431 3.7449 1.2120 2.5023 2.9668 5.2462 3.1983 3.6800 5.9234 3.6529 7.8242 2.4788 3.3067 5.8083 3.2256 4.8816 3.6110 4.0702 4.2506 3.6962 2.7828 5.9692 2.9724 6.3969 4.0430 6.9790 3.9470 8.0304 2.0044 1.9941 6.9873 1.6632 2.4538 1.3335 1.5004 2.6384 1.7548 1.5290 1.6704 4.5796 3.9234 2.4206 1.3451 1.3533 1.8236 1.7119 8.1736 1.6383 2.6091 2.4897 1.8458 2.6916 2.2392 1.5710 2.4233 3.4359 3.3039 1.8034 1.4640 2.0984 1.2370 1.4618 1.6393 1.9222 1.2488 1.5283 1.3052 1.2750 1.2806 1.3994 1.1610 1.2997 1.2820 1.3323 1.5731 1.3235 1.4029 1.6279 1.4601 1.4301 1.7263 3.2815 10.7260 1.2185 1.3905 2.4128 1.0884 1.0839 1.0773 1.1115 1.0714 1.0817 1.0614 1.0551 1.1217 1.1088 3.6630 6.8499 8.8348 1.0643 1.0440 1.0635 1.0718 1.0705 1.0638 1.0636 1.0615 1.0777 1.0672 1.0628 1.0971 1.1008 1.1012 1.0990 1.1023 1.0988 1.1027 1.1029 1.1044 1.0900 1.0888 1.0929 1.0975
irintensity: 0.0717 0.7517 0.2285 0.0991 0.3364 0.5664 1.4969 0.2886 0.1988 2.4191 0.3352 3.6749 0.5578 5.8205 1.3487 1.8604 0.9923 7.0292 2.1329 0.2583 0.1756 4.0670 1.3886 5.5517 2.1299 5.1766 6.9993 9.8552 17.0123 2.8415 20.7366 4.3052 10.8535 102.9812 16.5599 27.2027 14.6929 2.5042 54.1012 59.5019 1.2953 13.7488 37.0530 1.2516 1.7676 36.4754 19.1913 5.7430 76.6507 2.8727 3.0080 30.2432 7.3467 13.9906 2.2315 4.7691 11.5934 44.0611 27.4399 7.0258 3.9002 0.0763 13.0413 2.4660 51.0058 9.4460 12.0508 0.9634 13.5355 4.8007 29.1298 0.3288 4.0529 62.0222 7.6971 28.4685 2.4673 6.3144 7.0461 9.1118 9.8685 6.3464 1.1096 62.2254 1.9968 7.5521 1.1312 5.4929 5.7839 2.0986 4.4880 1.2076 42.4232 2.8730 17.8647 21.4215 16.1769 8.1743 16.9269 38.8302 2.4859 15.3445 6.7100 102.7157 7.6032 12.8109 2.9169 98.4445 17.2683 2.6518 9.4190 24.3434 22.1758 32.1705 507.5471 6.4893 8.3649 4.9959 48.2617 37.9736 18.4141 17.4581 26.2820 22.9039 11.9220 25.5646 59.0864 38.1793 63.3207 3.4865 30.9787 31.0549 54.1507 40.0485 30.9465 12.0969 52.9378 15.3916 1.7519 9.5283 4.1512
temp: 298.150 k
press: 1.00000 atm
elementType: 17 17 16 8 8 7 7 6 6 6 6 6 6 6 6 6 6 6 6 6 6 6 6 6 6 1 1 1 1 1 1 1 1 1 1 1 1 1 1 1 1 1 1 1 1 1 1 1 1
symmnumber: 1
zpe: 1025792.8 jmol-1
zpe.correction: 0.390704 hartree
zpe.thermalcorrener: 0.416653 hartree
zpe.thermalcorrenthalpy: 0.417597 hartree
zpe.thermalcorrgfe: 0.331333 hartree
zpe.sumelectzpe: -2276.365492 hartree
zpe.sumelectthermal: -2276.339543 hartree
zpe.sumelectthermalent: -2276.338599 hartree
zpe.sumelectthermalfe: -2276.424863 hartree
dipole: 5.8733 4.0575 -0.9664
dipole: 7.2036
quadrupole: -155.1182 -177.8752 -170.5268
quadrupole: -2.8195 5.0315 -2.9050
quadrupole: 12.7219 -10.0352 -2.6867 -2.8195 5.0315 -2.9050
hfenergy: -2276.7561958 hartree
pointgroup: C01 [X(C18H24Cl2N2O2S1)]
dipole: 2.3434414 -1.3412342 0.8611558 debye
polarizability: 349.781065|30.371297|226.9192547|11.6551498|-10.3255287|225.971299 unknown
InChI: InChI=1S/C18H24Cl2N2O2S/c1-13-6-5-7-15(13)18(22-10-3-2-4-11-22)21-25(23,24)14-8-9-16(19)17(20)12-14/h8-9,12-13,15H,2-7,10-11H2,1H3
charge 0 multiplicity 1
49 atoms
Cl -5.398569 -0.088011 -2.439304
Cl -6.468477 -0.792605 0.583967
S  -0.51839 1.574889 -0.299468
O  -0.590692 2.473923 -1.666424
O  -0.088417 2.289164 1.114429
N  2.631159 0.734381 -0.096116
N  0.341139 -0.058804 -0.547554
C  2.00364 -1.705815 -0.118044
C  1.312353 -2.443174 1.072458
C  1.53676 -2.548232 -1.343536
C  1.518724 -3.944466 0.71987
C  1.607591 -4.021081 -0.84196
C  1.643212 -0.216839 -0.237926
C  1.812446 -2.052265 2.474508
C  2.53306 2.118469 -0.644827
C  3.828227 0.539526 0.76975
C  3.829518 2.484744 -1.406018
C  5.139766 0.861763 0.024295
C  5.092737 2.300326 -0.537644
C  -2.243722 0.857749 -0.04873
C  -3.044831 0.672224 -1.183713
C  -2.669864 0.579273 1.258332
C  -4.345586 0.163182 -0.99169
C  -3.975778 0.073703 1.433748
C  -4.804673 -0.139865 0.311037
H  3.1021 -1.813275 -0.029256
H  0.234051 -2.197572 0.994215
H  2.157995 -2.366224 -2.238464
H  0.50049 -2.257621 -1.586365
H  0.700517 -4.565586 1.126426
H  2.457612 -4.309356 1.180257
H  0.790169 -4.623898 -1.275501
H  2.55636 -4.496057 -1.152126
H  2.893487 -2.266854 2.589386
H  1.64572 -0.978681 2.683765
H  1.279787 -2.628216 3.253649
H  2.339767 2.829369 0.181788
H  1.683919 2.181907 -1.34458
H  3.837865 -0.480863 1.176841
H  3.721195 1.230785 1.632853
H  3.738011 3.53281 -1.747473
H  3.904672 1.850697 -2.311096
H  5.281014 0.1382 -0.802499
H  5.989288 0.739145 0.72306
H  6.002461 2.518344 -1.127109
H  5.072949 3.021832 0.304892
H  -2.677326 0.939026 -2.179117
H  -2.012378 0.777205 2.110017
H  -4.356653 -0.15558 2.432796
