program: Gaussian 09
title: 000264209
version: EM64L-G09RevD.01
frameworkgroup: C1[X(C22H25N3O8S2)]
method: RPBEPBE
basis: SDD
operation: Freq
keyword: #p
keyword: freq=noraman
keyword: PBEPBE/SDD
title: #p freq=noraman PBEPBE/SDD
converged: YES YES NO NO
title: Mulliken charges:
elementType: S S O O O O O O O O N N N C C C C C C C C C C C C C C C C C C C C C C H H H H H H H H H H H H H H H H H H H H H H H H H
charge: 0.985550 0.964091 -0.417757 -0.392275 -0.270029 -0.500570 -0.516279 -0.500757 -0.525830 -0.284684 -0.169590 -0.395856 -0.387587 -0.433586 -0.467223 0.356931 -0.228555 -0.231508 0.147148 -0.172180 -0.054138 -0.040676 0.128789 -0.252194 -0.192386 -0.240046 -0.256507 0.465310 0.455222 -0.397711 -0.345862 -0.332520 -0.392814 -0.820394 -0.796660 0.262125 0.224905 0.219249 0.314137 0.213321 0.240698 0.230881 0.220788 0.292524 0.355249 0.342194 0.286938 0.282448 0.283590 0.287946 0.249172 0.257999 0.250852 0.248573 0.289646 0.220671 0.227641 0.244160 0.229575 0.237850
chargesum: 0.00000
title: Mulliken charges with hydrogens summed into heavy atoms:
elementType: S S O O O O O O O O N N N C C C C C C C C C C C C C C C C C C C C C C
charge: 0.985550 0.964091 -0.417757 -0.392275 -0.270029 -0.500570 -0.516279 -0.500757 -0.525830 -0.284684 -0.169590 -0.040606 -0.045393 0.053443 0.066163 0.356931 0.225464 0.220160 0.147148 0.120344 -0.054138 -0.040676 0.128789 0.034745 0.090062 0.043545 0.031439 0.465310 0.455222 -0.148539 -0.087863 -0.081668 -0.144241 -0.082437 -0.085075
polarizability: 4.05755974e+02 -9.33936078e+00 4.18216540e+02 -2.42871552e+01 -7.36515755e+00 2.62518880e+02
1716.lowfreq: -6.3715 -5.5049 -0.0018 0.0009 0.0009 5.5684 7.6673 8.4686 14.1555
frequency: -1.0266 7.7314 13.9025 16.5396 27.0937 29.3359 36.2770 37.5917 43.9778 49.4290 59.5431 68.1946 73.3946 85.2615 108.4401 111.2889 116.8406 122.8310 126.5967 131.4205 145.1985 151.2926 172.0750 185.5451 196.8233 206.6938 229.0200 231.6901 235.6531 246.3031 267.5248 295.5030 300.5862 309.9213 315.7971 326.7080 342.8882 351.4445 359.0115 372.6575 381.5856 383.3953 395.2258 407.4315 407.9191 409.0780 421.7380 448.9481 464.7430 473.5405 483.1317 505.0054 516.7480 533.0472 547.7896 578.1616 589.5468 593.4854 604.6103 620.4658 620.7810 626.8937 667.1587 686.0002 704.4339 704.7468 724.4626 750.4223 771.3037 777.2542 777.6289 802.1377 818.1505 824.2859 825.0004 828.6550 830.8300 831.7294 847.9780 848.3589 870.1779 911.2675 944.1977 952.2655 962.4434 964.1025 965.1555 981.6077 983.6278 985.5773 986.2832 990.0316 994.3163 996.1150 998.2871 1027.4389 1050.9746 1052.0411 1053.5870 1057.6621 1067.2576 1088.0807 1118.4809 1120.4815 1129.7686 1169.5058 1183.1913 1185.3223 1193.9399 1211.6705 1218.9925 1219.6558 1231.1781 1240.9316 1280.6476 1296.0610 1299.2264 1327.5251 1338.9584 1346.2588 1348.0907 1359.2858 1364.7703 1375.1402 1381.0316 1381.9476 1392.5463 1392.7046 1401.2926 1402.1761 1407.8398 1439.2992 1449.0068 1467.5679 1469.3677 1469.7080 1471.3183 1471.3461 1472.5949 1474.3768 1480.4947 1500.1818 1591.0820 1592.5611 1593.1949 1595.7951 1608.7083 1622.2817 1664.7156 2967.2407 2975.8227 2979.9774 2984.1913 2984.4972 2989.8217 3041.7555 3044.3431 3049.3666 3064.4761 3065.2427 3090.7313 3091.9563 3094.7154 3137.2616 3137.4209 3138.6947 3142.9012 3160.5443 3163.6853 3166.7649 3175.4999 3238.6209 3528.6171 3564.8284
redmass: 1.1407 6.1875 4.3952 5.9393 6.4278 6.0065 6.1268 4.6499 5.6175 5.9828 8.0413 8.5853 7.1241 6.4350 3.7858 5.3304 1.1373 5.5204 6.9552 6.1376 4.2727 4.8842 7.7062 5.9689 6.1582 4.5707 8.5025 7.0473 6.8174 4.9109 4.5172 4.9181 4.7889 4.3695 4.7554 4.1066 5.2554 5.9633 4.5221 6.2840 3.8967 4.1489 4.4830 3.4372 2.9099 3.9526 4.0703 6.3321 7.0326 4.5162 3.3537 3.0749 3.8245 6.7506 4.4385 3.1104 6.0900 6.2915 5.0222 5.6838 6.9540 1.3415 4.1993 2.4676 3.4170 3.3553 3.7386 5.5964 2.2040 4.8383 4.8734 1.4226 2.8980 4.0901 2.6359 2.4072 1.7632 2.5692 1.2445 1.2453 3.6205 2.2944 14.7640 13.9220 3.1269 1.3362 1.3037 2.8894 1.3750 1.3885 2.1303 3.0907 2.9690 2.6165 1.8740 2.3669 1.6002 2.4576 2.4515 1.5788 2.4519 2.6945 1.2805 1.2885 3.3775 1.9915 1.1346 1.1886 2.0760 1.2664 3.0931 2.9671 1.2012 1.8358 1.3594 1.2628 1.2644 1.4684 1.3418 1.5056 1.2447 1.3197 1.8718 1.9222 4.7133 4.4713 3.1811 3.0389 1.2832 1.3088 2.2667 2.6376 1.0790 1.0848 1.0525 1.0502 1.3858 1.6081 2.1779 1.1458 1.0974 1.1251 6.3312 6.2221 6.4432 6.5553 5.9763 5.0745 5.1179 1.0564 1.0584 1.0376 1.0383 1.0638 1.0666 1.1030 1.1060 1.1018 1.0968 1.0968 1.0962 1.0997 1.0994 1.0907 1.0889 1.0891 1.0893 1.0960 1.0972 1.0962 1.0950 1.0930 1.0769 1.0783
irintensity: 0.4059 0.6753 0.8986 1.1147 3.0126 1.2523 0.9894 0.3574 0.0573 1.3504 0.4756 0.3022 1.5963 3.7410 1.9877 3.3084 0.5203 2.5866 2.9525 2.5902 3.4660 10.2624 2.1749 1.4996 8.4846 19.5525 8.2893 2.5615 7.7843 5.9943 5.1200 8.6036 3.7615 1.4897 1.6742 8.8804 3.2183 5.3170 7.3700 11.9020 0.4376 2.7420 19.4737 6.5012 0.3701 13.4697 10.3577 32.1068 69.5027 7.7740 10.4550 42.2658 92.8709 11.1865 34.4994 26.3159 28.3429 40.6598 5.3920 9.0840 0.2218 110.5179 2.2199 5.1475 0.4680 0.7126 53.9312 8.0338 127.8838 6.0941 5.1089 125.7794 12.5125 110.5230 98.3143 38.9077 17.0203 11.3611 2.1048 0.3650 66.4471 14.2852 96.0273 65.1984 5.3054 1.1859 1.0763 30.7502 0.3995 1.0316 6.7965 2.7003 24.5998 26.0095 8.0496 2.4716 15.0392 16.6430 25.4890 17.0801 43.8800 45.7222 5.8844 4.0392 38.8609 20.4386 8.7912 9.8573 49.1875 6.8190 3.7810 6.4072 13.2411 40.1021 47.6698 2.2039 1.6989 69.2230 7.6514 9.6567 5.5032 4.6105 6.0144 52.4523 4.7744 3.5089 10.2253 12.6811 33.5399 15.1951 24.6612 4.3256 10.6019 43.2193 9.1536 15.3694 17.7717 14.1260 20.4423 14.7233 15.0227 10.6564 6.7048 20.0035 2.3451 5.5051 242.4150 160.5848 432.6896 50.4225 10.9905 20.0442 21.1553 23.7397 97.7296 26.0410 31.7349 10.3202 14.2900 12.2320 13.1929 16.5907 17.7474 6.7789 11.1302 3.2824 8.9654 0.4782 7.1580 4.5549 16.2891 2.8551 53.5531 53.4786
temp: 298.150 k
press: 1.00000 atm
elementType: 16 16 8 8 8 8 8 8 8 8 7 7 7 6 6 6 6 6 6 6 6 6 6 6 6 6 6 6 6 6 6 6 6 6 6 1 1 1 1 1 1 1 1 1 1 1 1 1 1 1 1 1 1 1 1 1 1 1 1 1
symmnumber: 1
zpe: 1173270.6 jmol-1
zpe.correction: 0.446875 hartree
zpe.thermalcorrener: 0.482461 hartree
zpe.thermalcorrenthalpy: 0.483405 hartree
zpe.thermalcorrgfe: 0.374069 hartree
zpe.sumelectzpe: -2412.599340 hartree
zpe.sumelectthermal: -2412.563754 hartree
zpe.sumelectthermalent: -2412.562810 hartree
zpe.sumelectthermalfe: -2412.672146 hartree
dipole: -4.3810 5.5455 -0.2432
dipole: 7.0714
quadrupole: -231.6377 -202.3070 -230.5546
quadrupole: 0.9772 -4.1775 -10.0344
quadrupole: -10.1379 19.1927 -9.0548 0.9772 -4.1775 -10.0344
hfenergy: -2413.046215 hartree
pointgroup: C01 [X(C22H25N3O8S2)]
dipole: -1.5166769 2.330734 0.0864728 debye
polarizability: 399.8416881|-7.2773773|419.9660111|-35.0048489|0.3153442|266.6836947 unknown
InChI: InChI=1S/C22H25N3O8S2/c1-16-3-7-18(8-4-16)34(28,29)32-13-11-25(20-15-23-22(27)24-21(20)26)12-14-33-35(30,31)19-9-5-17(2)6-10-19/h3-10,15,23-24H,11-14H2,1-2H3
charge 0 multiplicity 1
60 atoms
S  4.386636 -1.934578 -1.073354
S  -3.615667 -1.499804 -0.756516
O  2.477822 -2.072643 -1.219221
O  -2.934893 -1.813646 0.967398
O  0.170727 -0.522903 2.957671
O  5.088246 -2.291303 -2.490128
O  4.816131 -2.712545 0.287402
O  -4.930506 -2.411201 -1.012703
O  -2.365546 -1.609791 -1.792202
O  0.834388 3.220858 0.256031
N  0.047914 -2.31806 0.618027
N  0.388845 1.29615 1.540934
N  0.59906 1.113726 -0.763145
C  0.410637 -3.165589 -0.532266
C  -0.843636 -2.930202 1.625572
C  0.173707 -0.917033 0.524529
C  1.934893 -3.350733 -0.736097
C  -2.293053 -3.138467 1.132925
C  0.233431 -0.102413 1.762738
C  0.356406 -0.260391 -0.685076
C  4.386762 -0.081487 -0.812742
C  -4.107214 0.280444 -0.465819
C  0.623235 1.973172 0.335541
C  4.558275 0.742443 -1.935159
C  -3.107329 1.264713 -0.520712
C  4.181035 0.406419 0.488723
C  -5.459058 0.554123 -0.211957
C  4.265346 2.691129 -0.4458
C  -4.852538 2.942127 -0.048401
C  4.497839 2.140688 -1.734107
C  -3.496161 2.603443 -0.310664
C  4.128498 1.805174 0.658851
C  -5.821102 1.904985 -0.008862
C  4.122282 4.185668 -0.246665
C  -5.247021 4.387183 0.189717
H  -0.061998 -2.826698 -1.475187
H  0.009425 -4.177464 -0.336623
H  -0.436909 -3.921957 1.909784
H  -0.839861 -2.303906 2.530735
H  2.09991 -4.146523 -1.491019
H  2.416984 -3.633183 0.219877
H  -2.882764 -3.698817 1.883049
H  -2.312927 -3.702006 0.178747
H  0.352863 -0.784177 -1.637331
H  0.405036 1.871198 2.388981
H  0.828432 1.538263 -1.663203
H  4.742273 0.307371 -2.922797
H  -2.06917 0.997252 -0.734531
H  4.073316 -0.279861 1.334948
H  -6.198625 -0.252327 -0.187851
H  4.627664 2.810667 -2.591413
H  -2.735542 3.392162 -0.34536
H  3.964606 2.217441 1.660812
H  -6.87022 2.152635 0.186268
H  3.056841 4.4322 -0.075316
H  4.470501 4.752602 -1.126518
H  4.689279 4.534193 0.635117
H  -4.828869 4.757345 1.144865
H  -6.342002 4.510278 0.232887
H  -4.859633 5.045463 -0.608878
