program: Gaussian 09
title: 000264144
version: EM64L-G09RevD.01
frameworkgroup: C1[X(C26H24NO3P)]
method: RPBEPBE
basis: SDD
operation: Freq
keyword: #p
keyword: freq=noraman
keyword: PBEPBE/SDD
title: #p freq=noraman PBEPBE/SDD
converged: YES YES NO NO
title: Mulliken charges:
elementType: P O O O N C C C C C C C C C C C C C C C C C C C C C C C C C C H H H H H H H H H H H H H H H H H H H H H H H H
charge: 1.147343 -0.552886 -0.583431 -0.575814 -0.436397 -0.606777 0.517458 0.372561 -0.428322 -0.347346 0.288267 -0.368172 -0.227022 -0.240149 0.350674 0.400868 -0.395608 -0.237480 -0.851272 -0.236363 -0.264123 -0.345077 -0.372691 -0.344791 -0.344774 -0.206259 -0.191624 -0.210408 -0.197889 -0.250792 -0.245925 0.300662 0.355799 0.259771 0.266733 0.227994 0.228807 0.231882 0.230101 0.231652 0.223429 0.262692 0.235838 0.225155 0.228036 0.288597 0.254034 0.275305 0.281105 0.228823 0.229375 0.231435 0.229036 0.228423 0.229537
chargesum: 0.00000
title: Mulliken charges with hydrogens summed into heavy atoms:
elementType: P O O O N C C C C C C C C C C C C C C C C C C C C C C C C C C
charge: 1.147343 -0.552886 -0.583431 -0.575814 -0.080598 -0.306115 0.517458 0.372561 -0.168550 -0.080613 0.288267 -0.140178 0.001785 -0.008267 0.350674 0.400868 -0.165507 -0.005828 -0.129314 -0.011208 -0.036087 -0.056481 -0.118656 -0.069487 -0.063668 0.022564 0.037751 0.021027 0.031147 -0.022369 -0.016388
polarizability: 3.94944445e+02 1.53081444e+01 3.01110836e+02 -5.17573880e+00 2.44931550e+00 2.84418757e+02
1716.lowfreq: -8.3053 -7.4477 -4.7775 -0.0015 -0.0013 -0.0012 9.6276 14.2696 17.5539
frequency: 9.0581 14.2124 17.1340 23.6407 25.6831 26.6384 31.8872 39.9745 43.0024 76.8139 90.9266 108.8276 124.9823 128.4289 147.7303 166.2162 183.7069 192.3779 204.8864 208.1691 224.1602 244.2814 253.8243 285.7463 328.3262 361.2123 376.9840 393.6313 402.2431 407.5619 411.0484 411.7906 436.7445 449.2383 468.9032 478.3872 490.3201 527.0124 534.3278 541.8628 551.1755 574.4099 589.4245 606.9186 611.8359 615.3914 632.5584 639.7260 664.4320 687.0693 692.9331 693.6048 702.0121 717.7779 753.8997 762.7305 765.1990 767.9521 770.9066 813.2965 827.5111 833.7164 838.5839 841.1112 847.4287 854.8444 859.8776 915.9797 919.9269 929.1479 931.8262 971.1360 972.0037 973.2551 980.1431 983.6055 985.4383 987.1105 990.1190 990.5848 991.3926 999.4750 1019.4164 1020.1817 1023.8197 1027.8929 1042.1415 1048.6051 1073.6894 1076.7511 1080.5777 1098.7890 1139.5427 1156.7473 1160.4694 1169.4491 1169.8245 1172.1176 1173.8177 1180.7659 1184.6021 1193.6323 1195.6731 1196.9999 1224.2865 1279.3511 1283.1271 1305.4898 1305.9725 1310.2453 1328.7297 1377.1744 1378.6345 1381.5040 1384.2032 1397.2996 1437.4347 1438.9069 1440.5130 1440.5370 1460.5933 1467.4361 1470.6964 1479.5550 1482.6687 1490.6704 1515.0888 1590.5305 1591.6225 1594.3429 1595.5650 1599.2949 1602.4826 1612.1199 1617.5697 2958.8742 3033.9629 3052.2209 3087.9808 3121.4715 3126.6014 3128.4859 3129.8560 3130.8597 3133.0223 3140.7841 3140.9001 3144.4718 3145.0255 3156.8080 3157.4807 3157.6933 3164.9469 3167.1980 3168.0071 3168.9671 3174.7764 3174.9054 3521.6959
redmass: 4.8210 5.5323 4.1718 4.1594 4.5536 4.2559 4.7668 5.3596 4.8878 5.7990 6.1995 6.1148 5.7173 5.8643 4.0712 6.1738 6.1068 4.5399 3.1011 1.3514 4.1348 4.7367 4.4529 6.7916 4.2871 6.7577 6.3062 3.7305 2.8916 5.5804 3.0355 2.9564 3.3529 4.0106 4.6391 4.0842 3.7652 4.4270 4.2157 4.1136 4.2178 5.2590 5.9846 6.3422 6.4224 6.1154 5.3660 5.1397 2.1605 4.4423 2.2285 2.2377 1.8423 2.4001 1.5031 1.7424 1.6111 1.5646 4.3393 6.9765 4.3422 5.2927 1.3006 1.2465 1.6631 1.2639 2.3846 1.4194 1.4241 1.3901 1.4438 1.3627 1.3291 1.3698 1.5881 1.6179 4.3009 5.6381 1.4363 3.9415 1.3436 1.3193 2.3330 2.1801 7.7211 2.3109 1.5417 2.0447 1.5036 1.5416 1.9165 2.0301 1.8981 2.3533 1.6527 1.0823 1.0777 1.0802 1.0547 1.3013 1.3260 1.4705 1.4049 1.8534 2.7183 1.5477 1.8684 1.4125 1.6505 1.3341 1.3199 4.5303 8.5181 9.2696 7.0807 1.2935 2.2172 2.2536 2.2422 2.2570 1.6008 2.2043 2.1800 1.0784 2.2014 1.4841 1.6917 6.2674 6.1727 5.3509 6.2557 6.3067 6.3114 5.9221 6.0524 1.0408 1.0954 1.0844 1.0965 1.0864 1.0853 1.0882 1.0851 1.0850 1.0887 1.0899 1.0896 1.0935 1.0926 1.0954 1.0936 1.0942 1.1006 1.0962 1.1011 1.0959 1.1006 1.1003 1.0748
irintensity: 0.3455 0.0413 0.2886 0.2131 0.0348 0.1322 0.2353 0.1652 0.5108 0.9311 2.5208 3.5603 0.9033 1.6917 0.6047 28.5198 13.0146 2.8464 5.5513 0.5296 2.8222 2.1711 2.6850 13.2695 34.0829 7.4805 29.0166 3.1867 0.1151 24.8494 0.8587 0.5703 5.9365 18.4920 19.7627 16.7067 48.3282 2.1939 4.9397 9.9545 19.8370 7.1755 33.5892 15.4138 1.0234 1.1067 18.0144 136.0104 171.0563 58.4647 31.3104 26.5517 45.0606 1.7451 104.5883 46.7484 84.7327 72.9971 8.6080 196.0564 51.9084 155.7337 13.7017 0.5853 2.6459 0.3324 1.6319 4.8908 6.8020 4.7530 4.6133 0.6099 0.2040 0.1013 0.7162 5.6640 0.9672 0.5263 0.3242 0.4572 0.5153 0.7177 41.7069 14.4052 62.5010 8.8527 9.3320 13.9357 8.2949 9.9232 7.3566 2.4719 62.0852 236.0067 65.2196 6.6607 6.6693 0.7261 1.4867 70.7102 38.2623 50.3339 17.1149 3.4152 38.3310 3.8608 72.1899 12.2717 55.1155 1.3096 0.9058 10.5854 0.6053 0.5213 0.5209 15.6495 20.5707 7.7509 20.1695 2.9891 34.5092 165.6952 89.5346 17.5049 19.8797 82.0723 157.4250 23.9965 8.8240 63.0352 27.9974 48.7711 31.4666 7.5085 31.5342 24.6298 12.8902 1.3684 17.2674 12.5715 0.5734 7.6465 0.1236 0.5514 3.1933 17.8535 13.3704 30.2796 12.3417 23.0743 30.3783 23.2369 22.2595 7.9003 27.0280 3.7058 14.3793 8.5340 27.2773
temp: 298.150 k
press: 1.00000 atm
elementType: 15 8 8 8 7 6 6 6 6 6 6 6 6 6 6 6 6 6 6 6 6 6 6 6 6 6 6 6 6 6 6 1 1 1 1 1 1 1 1 1 1 1 1 1 1 1 1 1 1 1 1 1 1 1 1
symmnumber: 1
zpe: 1129905.9 jmol-1
zpe.correction: 0.430358 hartree
zpe.thermalcorrener: 0.459026 hartree
zpe.thermalcorrenthalpy: 0.459971 hartree
zpe.thermalcorrgfe: 0.364724 hartree
zpe.sumelectzpe: -1624.633570 hartree
zpe.sumelectthermal: -1624.604902 hartree
zpe.sumelectthermalent: -1624.603958 hartree
zpe.sumelectthermalfe: -1624.699204 hartree
dipole: -0.4554 1.3613 1.5613
dipole: 2.1209
quadrupole: -169.2376 -179.8693 -182.6789
quadrupole: 5.5967 6.2200 -4.8980
quadrupole: 8.0243 -2.6073 -5.4170 5.5967 6.2200 -4.8980
hfenergy: -1625.0639285 hartree
pointgroup: C01 [X(C26H24N1O3P1)]
dipole: -0.4382104 0.4792034 0.5240321 debye
polarizability: 351.5795336|46.3429469|340.4372877|-17.7751941|-14.7749667|288.4572167 unknown
InChI: InChI=1S/C14H14N.C12H10O3P/c1-12-7-5-6-10-14(12)15-11-13-8-3-2-4-9-13;13-16(14-11-7-3-1-4-8-11)15-12-9-5-2-6-10-12/h2-11,15H,1H3;1-10H
charge 0 multiplicity 1
55 atoms
P  0.68392 -0.136337 -0.873189
O  0.067815 -1.53282 0.034506
O  1.675964 0.521348 0.413221
O  1.418219 -0.508409 -2.238668
N  -1.100636 1.349257 0.671686
C  -0.760418 1.236639 -0.714877
C  -0.304064 2.514963 -1.410384
C  -2.216069 0.706464 1.269301
C  -0.394358 3.761195 -0.743895
C  0.161019 2.474733 -2.751514
C  -2.11888 0.263591 2.62749
C  -3.431226 0.537808 0.553837
C  -0.021981 4.952689 -1.406244
C  0.529523 3.666508 -3.409941
C  -0.707698 -2.561354 -0.579331
C  2.957824 0.022503 0.779666
C  -3.251013 -0.345544 3.216388
C  0.441479 4.909903 -2.740364
C  -0.824845 0.426332 3.404994
C  -4.539166 -0.087689 1.162133
C  -4.456087 -0.534468 2.499984
C  -0.285665 -3.207765 -1.765053
C  4.011533 0.958232 0.850727
C  -1.88778 -2.946654 0.094904
C  3.148198 -1.335376 1.12099
C  -1.074614 -4.26275 -2.277956
C  5.284129 0.523708 1.28378
C  -2.655758 -4.011084 -0.426819
C  4.430473 -1.755836 1.53993
C  -2.255051 -4.670273 -1.613289
C  5.498575 -0.83241 1.625865
H  -1.581498 0.755403 -1.272792
H  -0.310995 1.560747 1.287712
H  -0.779815 3.793492 0.279909
H  0.255027 1.515929 -3.274883
H  -3.526452 0.918856 -0.468949
H  -0.099558 5.912055 -0.882526
H  0.889685 3.624143 -4.443589
H  -3.179275 -0.689343 4.255445
H  0.729585 5.833816 -3.254013
H  -0.560486 1.491916 3.563852
H  0.025805 -0.053409 2.883175
H  -0.907384 -0.035129 4.402943
H  -5.46758 -0.211015 0.593739
H  -5.314645 -1.014621 2.980943
H  0.630365 -2.88301 -2.268041
H  3.823807 1.998548 0.568088
H  -2.186482 -2.414939 1.003509
H  2.307643 -2.033927 1.062695
H  -0.758905 -4.769277 -3.196855
H  6.107729 1.243565 1.345052
H  -3.570301 -4.317927 0.092571
H  4.590834 -2.806911 1.804228
H  -2.856156 -5.493037 -2.015259
H  6.488593 -1.16603 1.95467
