program: Gaussian 09
title: 000264140
version: EM64L-G09RevD.01
frameworkgroup: C1[X(C21H21NO6)]
method: RPBEPBE
basis: SDD
operation: Freq
keyword: #p
keyword: freq=noraman
keyword: PBEPBE/SDD
title: #p freq=noraman PBEPBE/SDD
converged: YES YES NO NO
title: Mulliken charges:
elementType: O O O O O O N C C C C C C C C C C C C C C C C C C C C C H H H H H H H H H H H H H H H H H H H H H
charge: -0.262235 -0.268552 -0.256665 -0.292764 -0.301277 -0.309781 -0.260581 -0.409921 -0.559094 0.203155 0.056919 0.496361 -0.411600 0.541998 -0.535816 -0.575764 0.261506 0.308287 0.035735 -0.452781 -0.427052 0.175033 0.163331 -0.346495 -0.202975 -0.525234 -0.527077 -0.524097 0.236630 0.242201 0.246704 0.247716 0.266165 0.333891 0.272502 0.267553 0.242615 0.254787 0.240426 0.240401 0.264687 0.226873 0.212288 0.248296 0.223742 0.228447 0.229671 0.224415 0.257424
chargesum: 0.00000
title: Mulliken charges with hydrogens summed into heavy atoms:
elementType: O O O O O O N C C C C C C C C C C C C C C C C C C C C C
charge: -0.262235 -0.268552 -0.256665 -0.292764 -0.301277 -0.309781 -0.260581 0.068910 -0.064674 0.203155 0.056919 0.496361 -0.145435 0.541998 -0.201925 -0.303262 0.261506 0.308287 0.035735 -0.185228 -0.184436 0.175033 0.163331 -0.091707 0.277852 0.178614 0.173409 0.187412
polarizability: 5.73686625e+02 1.15840956e+01 2.62830829e+02 2.02458825e+00 1.22736320e+00 1.31482248e+02
1716.lowfreq: -35.9927 -9.9351 -4.6234 -3.3172 -0.0004 0.0005 0.0011 9.8510 16.5687
frequency: -35.9889 9.3672 16.3621 40.9601 47.1221 58.3805 70.5855 79.6985 82.9881 90.6614 106.1224 123.8987 142.1682 147.8943 161.8967 167.2185 170.5849 183.8251 199.8383 214.1752 227.1756 232.8632 245.3938 276.1421 290.1909 303.3739 317.2815 329.8800 342.8234 371.3229 408.2080 414.9525 447.2433 467.3706 478.4759 506.8638 518.5503 568.4494 598.1064 613.1495 622.3499 641.3600 645.0267 661.8989 678.7090 682.7160 695.7200 725.9493 731.7328 759.2703 759.9381 790.6082 801.3649 817.2324 840.1790 841.7407 857.5449 870.2426 876.4901 902.5034 921.3132 932.4489 933.7837 941.5146 968.8952 977.4098 995.9512 1019.6527 1036.9398 1044.9769 1049.8832 1064.3099 1065.1393 1111.1690 1112.9281 1115.0080 1119.9248 1122.1659 1134.4174 1144.4238 1151.9584 1159.4776 1164.1585 1190.8537 1191.9898 1203.8480 1209.6315 1228.5285 1232.7592 1262.5862 1271.3093 1294.9212 1329.3248 1351.7401 1357.3642 1368.5147 1378.3310 1403.8293 1405.4968 1419.4323 1435.9356 1440.4305 1451.4636 1454.3752 1458.2799 1460.3281 1465.7898 1467.9644 1477.5030 1480.2496 1484.1024 1487.0341 1488.4680 1498.4687 1558.9513 1597.1415 1598.8986 1607.4120 1623.6784 1662.0536 2971.6658 2972.7327 2976.5017 2981.4435 2992.7993 3015.4452 3026.9413 3049.7069 3069.1466 3077.2971 3080.2927 3086.6061 3094.2374 3119.2740 3119.4195 3124.7902 3146.3267 3180.0286 3184.5035 3196.3013 3214.6415
redmass: 2.3079 4.8268 6.0152 5.8012 4.6045 4.3476 3.0245 4.5282 3.2454 2.9948 4.5484 2.4626 1.8727 1.5145 1.2854 2.8399 1.2072 4.1928 5.9122 3.5762 5.5668 5.9866 4.9696 6.5979 7.4393 5.7376 5.1198 4.9822 6.3578 5.7718 3.0473 4.9322 5.5243 3.1175 6.9420 6.5468 5.6536 7.0788 5.9716 3.6445 6.0704 4.2933 5.2843 5.0062 8.0036 6.6159 5.1010 3.5188 5.8495 6.2995 4.3165 6.1174 6.2497 1.3680 9.8198 1.6372 1.5780 4.6437 1.5171 5.7043 1.4901 4.9312 1.3391 8.1562 1.4649 5.5274 4.4868 2.9517 6.0046 1.6136 2.6507 3.4815 1.4572 1.2401 1.2453 1.2419 1.0365 4.2499 1.5510 1.8907 1.4133 1.4705 2.4522 1.6446 1.3350 1.9670 1.9537 1.4383 1.3485 1.9392 2.1840 1.7918 2.3993 5.7994 2.3931 1.5673 2.7330 2.0359 2.0393 1.2631 1.2791 1.6188 3.2894 1.1511 1.0582 1.1070 1.2320 2.1454 1.0721 1.8953 1.0550 1.0565 1.4891 1.1084 7.5303 9.6359 8.4768 6.9076 8.3100 8.9267 1.0314 1.0334 1.0297 1.0579 1.0608 1.0534 1.1050 1.1045 1.1035 1.1050 1.0984 1.0877 1.1190 1.1028 1.1033 1.1046 1.0898 1.0908 1.0958 1.0928 1.0913
irintensity: 13.6548 0.1198 0.6850 0.3712 1.1902 7.9019 2.3121 0.4736 4.5122 8.3033 0.6293 1.1762 0.8667 0.9380 0.3423 2.1803 0.0611 4.1973 0.2564 5.4665 6.5702 0.3379 6.3219 8.3582 6.6154 7.5565 5.1065 2.4037 0.4202 7.5674 1.3692 5.1455 4.7968 3.3736 22.2509 21.0803 1.7751 1.0687 5.5700 19.4509 3.5361 3.6093 2.4793 39.7002 4.8541 13.8889 5.6158 2.5722 1.6256 12.7458 6.9255 11.6982 4.9280 36.4272 24.2831 30.4518 4.4745 5.4378 11.6475 47.4726 30.4637 29.8754 7.9385 78.2451 17.1749 214.5324 17.4853 21.9261 120.0163 0.6921 94.4123 25.6963 4.1721 14.3191 11.5838 3.6419 0.0024 16.0891 15.6649 6.2964 2.6800 13.8459 18.5503 49.1428 27.8869 40.4978 283.4111 380.5359 289.8932 104.6312 150.1200 4.3040 32.2151 73.5224 38.5092 33.6749 25.3413 40.5076 32.3624 55.6782 13.7245 38.9595 192.9049 47.1257 8.8315 45.6896 47.4974 304.1324 11.5857 79.9547 21.3082 43.5709 52.4361 4.9616 76.4749 136.2312 68.6631 178.2245 16.0568 23.2444 53.2995 131.9148 78.2657 27.6368 36.0501 158.7606 1.3096 31.4222 27.6274 20.4263 37.0416 0.8630 30.6425 20.4256 36.8731 16.6951 5.4564 3.3669 8.1887 23.3611 2.2337
temp: 298.150 k
press: 1.00000 atm
elementType: 8 8 8 8 8 8 7 6 6 6 6 6 6 6 6 6 6 6 6 6 6 6 6 6 6 6 6 6 1 1 1 1 1 1 1 1 1 1 1 1 1 1 1 1 1 1 1 1 1
symmnumber: 1
zpe: 996136.9 jmol-1
zpe.correction: 0.379409 hartree
zpe.thermalcorrener: 0.405416 hartree
zpe.thermalcorrenthalpy: 0.406360 hartree
zpe.thermalcorrgfe: 0.320517 hartree
zpe.sumelectzpe: -1316.819435 hartree
zpe.sumelectthermal: -1316.793428 hartree
zpe.sumelectthermalent: -1316.792484 hartree
zpe.sumelectthermalfe: -1316.878327 hartree
dipole: -1.2491 3.3371 -1.0262
dipole: 3.7081
quadrupole: -118.7512 -160.0530 -161.8254
quadrupole: -8.1573 -4.3802 -0.0458
quadrupole: 28.1253 -13.1764 -14.9488 -8.1573 -4.3802 -0.0458
hfenergy: -1317.1988434 hartree
pointgroup: C01 [X(C21H21N1O6)]
dipole: -0.497164 -1.3489759 0.2477888 debye
polarizability: 572.6900595|-13.8123992|260.5867753|-18.2438741|18.5296779|134.722867 unknown
InChI: InChI=1S/C21H21NO6/c1-24-18-10-15(11-19(25-2)20(18)26-3)22-7-6-14(21(22)23)8-13-4-5-16-17(9-13)28-12-27-16/h4-5,8-11H,6-7,12H2,1-3H3
charge 0 multiplicity 1
49 atoms
O  0.241016 1.978527 0.260277
O  -6.716486 -1.764134 -0.12277
O  -8.134986 0.142203 0.239766
O  5.018063 -2.659266 -0.611994
O  4.974602 2.25899 -0.039371
O  6.494596 -0.159435 -0.427656
N  0.810497 -0.316502 -0.102958
C  0.108489 -1.613445 -0.256706
C  -1.409719 -1.279718 -0.184754
C  -1.469311 0.215899 0.048918
C  -0.081639 0.764295 0.087674
C  2.230697 -0.252067 -0.146647
C  -2.529845 1.067387 0.213881
C  -3.97054 0.80733 0.217141
C  2.924711 0.98535 -0.032069
C  2.976077 -1.452939 -0.292905
C  4.385119 -1.425014 -0.369349
C  4.328547 1.000313 -0.096229
C  5.083805 -0.190099 -0.298083
C  -4.550212 -0.493704 0.018933
C  -4.837326 1.924017 0.429325
C  -5.937407 -0.590942 0.046758
C  -6.775121 0.526214 0.259297
C  -6.248355 1.805928 0.45471
C  -8.132757 -1.327048 -0.009019
C  6.139032 -3.023821 0.282554
C  5.862998 2.445039 1.13031
C  6.960057 0.476245 -1.686388
H  0.411776 -2.305603 0.551192
H  0.382526 -2.078291 -1.221712
H  -1.895441 -1.843019 0.633335
H  -1.916732 -1.566435 -1.124933
H  -2.235599 2.117228 0.367952
H  2.379387 1.919721 0.105576
H  2.500347 -2.433108 -0.366854
H  -3.941355 -1.38101 -0.15046
H  -4.38775 2.911749 0.578088
H  -6.895644 2.670673 0.618199
H  -8.599714 -1.83527 0.851834
H  -8.650994 -1.528434 -0.962206
H  6.937614 -2.265335 0.240842
H  6.499985 -3.993466 -0.093377
H  5.773673 -3.13625 1.321865
H  6.65526 1.675045 1.1512
H  5.271409 2.406792 2.064749
H  6.301642 3.447081 1.007112
H  6.600345 -0.101789 -2.557614
H  8.059769 0.448778 -1.641028
H  6.600295 1.518844 -1.744904
