program: Gaussian 09
title: 000264098
version: EM64L-G09RevD.01
frameworkgroup: C1[X(C17H25BrO2S)]
method: RPBEPBE
basis: SDD
operation: Freq
keyword: #p
keyword: freq=noraman
keyword: PBEPBE/SDD
title: #p freq=noraman PBEPBE/SDD
converged: NO YES NO NO
title: Mulliken charges:
elementType: Br S O O C C C C C C C C C C C C C C C C C H H H H H H H H H H H H H H H H H H H H H H H H H
charge: -0.106265 0.818755 -0.567603 -0.570716 -0.033152 0.233104 0.063526 -0.274802 0.265162 0.394342 -0.721848 -0.728693 -0.853161 -0.806623 -0.721265 -0.701686 -0.719616 -0.349790 -0.330881 -0.298406 -0.293063 0.281487 0.247010 0.221013 0.268982 0.226067 0.277586 0.242387 0.232552 0.259378 0.267908 0.238963 0.235218 0.243572 0.246355 0.284065 0.250110 0.280644 0.252538 0.264998 0.240623 0.265591 0.259433 0.242470 0.234324 0.239406
chargesum: 0.00000
title: Mulliken charges with hydrogens summed into heavy atoms:
elementType: Br S O O C C C C C C C C C C C C C C C C C
charge: -0.106265 0.818755 -0.567603 -0.570716 -0.033152 0.233104 0.063526 -0.274802 0.265162 0.394342 0.027662 0.043941 -0.118843 -0.064535 0.052728 0.081606 0.051595 -0.090357 -0.088411 -0.064082 -0.053657
polarizability: 3.11583926e+02 -1.38158748e+00 2.44978112e+02 -8.67849393e+00 -9.03166791e+00 1.82173697e+02
1716.lowfreq: -3.4682 -0.0008 0.0005 0.0012 5.4352 10.9114 41.6616 48.3617 69.6666
frequency: 41.4371 48.2882 69.6066 99.0572 118.0799 127.1007 146.4432 167.3109 173.2993 183.4055 187.7453 191.5457 204.7637 212.5836 219.4580 231.8874 236.9787 248.1520 252.7548 259.4007 268.8920 276.2004 293.9272 299.3481 322.5113 341.8603 355.6035 361.7522 380.1619 385.9007 398.3969 401.4683 425.2213 440.6874 462.5573 474.6867 493.9030 523.2146 531.7830 542.2710 563.7547 595.0727 602.3612 648.8536 684.1858 748.7588 759.3150 777.6211 786.0162 803.2435 875.7573 882.4950 901.7992 923.1134 935.4918 941.8692 950.7529 951.1282 965.9461 988.1196 995.3224 998.4403 1011.8869 1023.6739 1032.1266 1048.9949 1075.0759 1085.8171 1103.0712 1113.3867 1125.1909 1132.8860 1148.2765 1170.3571 1174.8526 1201.5095 1220.5318 1229.5430 1239.6960 1259.0675 1296.5706 1298.4843 1379.0351 1381.6112 1387.4456 1392.7711 1398.3608 1403.3745 1419.9511 1420.3386 1439.2234 1446.8873 1452.6884 1457.3713 1458.7722 1466.5890 1469.1378 1471.3607 1481.8039 1486.2968 1488.0784 1492.3499 1504.7555 1512.1009 1527.4340 1577.3234 1602.6804 2983.9629 2984.9837 2993.7775 2995.6096 2995.8273 2997.7130 3022.6100 3069.8915 3071.4336 3078.3493 3080.0407 3090.9766 3091.0325 3105.9292 3106.9403 3109.0238 3111.4492 3114.7891 3117.1510 3122.0013 3131.5167 3135.4017 3157.7352 3186.8886 3214.2811
redmass: 4.2128 4.4824 3.6278 3.3542 6.1352 3.2091 1.7077 1.6762 3.7639 2.8393 1.8371 2.4671 2.2146 1.9339 2.4800 2.0971 2.4893 2.1150 2.2226 3.9286 2.5472 1.7076 3.0511 2.1918 2.4757 2.7774 2.5542 3.9006 3.1197 2.8731 2.9088 2.8813 3.2887 3.0423 1.8056 2.9155 1.9913 3.7251 3.2830 3.5235 3.3766 3.2543 3.8667 5.1043 4.1031 2.3904 2.6309 1.6990 15.2621 2.9859 1.5050 15.3607 2.5528 2.1938 1.3940 1.4656 1.7447 1.7535 1.3751 1.3297 1.3489 1.2925 1.3137 1.8512 2.7004 2.7919 1.6914 2.1007 1.7973 1.7427 2.4781 2.2049 2.0594 2.4185 2.3239 1.3339 3.7400 2.6977 4.1222 3.3415 2.0009 2.8051 1.1866 1.1773 1.1871 1.1776 1.1731 1.1745 1.5641 1.2611 1.0487 1.0457 1.0942 1.0591 1.6821 1.1049 1.0846 1.0568 1.0489 1.0537 1.0640 1.0644 1.0786 1.0495 1.0501 4.9741 5.6424 1.0371 1.0377 1.0365 1.0364 1.0358 1.0375 1.0357 1.0979 1.0968 1.0982 1.0989 1.0996 1.0990 1.0994 1.0995 1.0980 1.0979 1.1012 1.0994 1.0967 1.1009 1.0868 1.0959 1.0928 1.0902
irintensity: 0.7649 0.5532 2.0252 1.8385 10.6687 9.2320 0.3096 1.8946 5.1398 0.8272 2.9506 0.2156 6.1268 5.4984 8.0098 1.5523 0.6607 11.5904 0.0825 30.2502 0.6487 1.7994 3.3161 1.4678 1.6618 1.4345 5.9012 22.8871 5.4399 7.1913 2.9669 7.1669 1.1253 10.3997 4.7900 25.5222 0.8033 2.0539 2.0114 12.6068 2.6541 2.5079 49.5791 7.1516 7.3370 29.3823 11.6459 31.7897 65.6336 1.8857 0.5372 69.7546 4.8862 1.5801 0.0924 3.0357 5.2806 6.7927 1.4769 2.0351 0.0790 2.7002 3.5599 42.5508 6.6804 20.3234 64.5144 5.7152 45.7861 13.2808 38.2189 6.1856 14.4587 28.1411 0.3091 9.3699 6.4877 3.3935 4.7656 25.3819 3.1164 1.0030 24.6403 10.1582 24.7559 38.2568 22.1263 69.2879 6.7654 33.5638 15.7136 3.6624 8.5069 3.4755 37.1849 6.0824 9.1766 5.7623 28.1539 7.0784 8.4614 8.6876 6.5664 7.1389 7.6837 4.1108 1.4650 8.0210 11.8128 9.6384 23.1426 11.6953 48.4949 12.0945 1.2512 1.8209 8.8610 18.7768 15.4305 1.1323 5.1744 12.3532 21.1451 9.9503 15.4455 3.9602 3.7560 9.9327 6.1751 18.8872 8.9936 9.2112
temp: 298.150 k
press: 1.00000 atm
elementType: 35 16 8 8 6 6 6 6 6 6 6 6 6 6 6 6 6 6 6 6 6 1 1 1 1 1 1 1 1 1 1 1 1 1 1 1 1 1 1 1 1 1 1 1 1 1
symmnumber: 1
zpe: 994438.4 jmol-1
zpe.correction: 0.378762 hartree
zpe.thermalcorrener: 0.402609 hartree
zpe.thermalcorrenthalpy: 0.403553 hartree
zpe.thermalcorrgfe: 0.328599 hartree
zpe.sumelectzpe: -1222.982164 hartree
zpe.sumelectthermal: -1222.958317 hartree
zpe.sumelectthermalent: -1222.957373 hartree
zpe.sumelectthermalfe: -1223.032327 hartree
dipole: -2.1875 5.1721 -0.2724
dipole: 5.6223
quadrupole: -142.0716 -152.6507 -147.2546
quadrupole: -14.0455 -5.2612 -3.3727
quadrupole: 5.2541 -5.3251 0.0710 -14.0455 -5.2612 -3.3727
hfenergy: -1223.3609258 hartree
pointgroup: C01 [X(C17H25Br1O2S1)]
dipole: 1.4466277 -1.6598944 0.2117047 debye
polarizability: 256.0037687|25.8304237|300.0054377|13.0204353|0.0490293|182.7265287 unknown
InChI: InChI=1S/C17H25BrO2S/c1-12(2)17(7,18)14-11-9-8-10-13(14)15(3,4)16(5,6)21(19)20/h8-11H,1-7H3
charge 0 multiplicity 1
46 atoms
Br 1.493489 3.603307 -0.45632
S  -2.101879 0.269823 0.219071
O  -3.048353 0.365372 1.560634
O  -2.877529 0.406263 -1.228705
C  -1.248958 -1.63122 0.300864
C  -0.048704 -1.762273 -0.716487
C  -0.797019 1.983168 0.394496
C  0.391263 1.643627 -0.51036
C  1.207075 -0.928262 -0.22166
C  1.33946 0.511308 0.004809
C  -0.884508 -1.770948 1.782644
C  -2.506268 -2.44989 -0.050776
C  0.265509 -3.307394 -0.710183
C  -0.467107 -1.490801 -2.208803
C  -0.545853 2.059686 1.894931
C  -1.78781 3.037563 -0.105585
C  0.084557 1.623527 -2.014391
C  2.328991 -1.722182 0.16651
C  2.475345 0.949566 0.747672
C  3.479269 -1.239943 0.816119
C  3.528535 0.117683 1.16373
H  -1.741126 -1.467747 2.409875
H  -0.002074 -1.175865 2.066655
H  -0.662803 -2.832393 2.002837
H  -3.361184 -2.111387 0.561818
H  -2.335128 -3.514515 0.190076
H  -2.786526 -2.357912 -1.111492
H  1.070682 -3.530424 -1.43231
H  0.547537 -3.707802 0.278156
H  -0.625704 -3.85392 -1.054871
H  -1.328546 -0.811596 -2.297086
H  0.384289 -1.082914 -2.775738
H  -0.761401 -2.43684 -2.695614
H  0.195729 1.326175 2.248211
H  -0.174186 3.072723 2.137956
H  -1.496391 1.900383 2.435925
H  -1.284407 4.019656 -0.145903
H  -2.18926 2.797902 -1.103357
H  -2.638532 3.108772 0.594306
H  -0.220902 2.61951 -2.365586
H  0.974661 1.313656 -2.58315
H  -0.754234 0.945571 -2.229704
H  2.310347 -2.79197 -0.030532
H  2.554699 2.011762 0.978944
H  4.295888 -1.926389 1.064052
H  4.370566 0.541287 1.720424
