program: Gaussian 09
title: 000264088
version: EM64L-G09RevD.01
frameworkgroup: C1[X(C10H12N2O4)]
method: RPBEPBE
basis: SDD
operation: Freq
keyword: #p
keyword: freq=noraman
keyword: PBEPBE/SDD
title: #p freq=noraman PBEPBE/SDD
converged: YES YES NO NO
title: Mulliken charges:
elementType: O O O O N N C C C C C C C C C C H H H H H H H H H H H H
charge: -0.266495 -0.271873 -0.260805 -0.240841 -0.179172 -0.406141 -0.121303 -0.135368 -0.466223 -0.003673 -0.308238 -0.223515 0.214581 0.235565 0.096408 -0.762978 0.246084 0.254913 0.239359 0.270666 0.290274 0.221783 0.232501 0.274637 0.361780 0.247907 0.210467 0.249698
chargesum: 0.00000
title: Mulliken charges with hydrogens summed into heavy atoms:
elementType: O O O O N N C C C C C C C C C C
charge: -0.266495 -0.271873 -0.260805 -0.240841 -0.179172 -0.044361 0.124781 0.119545 0.043802 0.286602 0.146046 0.051122 0.214581 0.235565 0.096408 -0.054905
polarizability: 1.84061720e+02 7.76173935e+00 1.26111335e+02 -3.21791925e+00 -1.65352957e+00 8.53003399e+01
1716.lowfreq: -8.7609 -4.5813 -0.0011 -0.0010 -0.0008 4.2742 39.9518 52.2964 57.9880
frequency: 39.7090 52.2722 57.9802 101.9239 117.1950 122.2407 166.5522 173.7710 255.3124 267.1594 279.0901 351.8273 373.4590 390.6830 408.1498 455.1034 471.0872 540.1377 593.1828 622.2962 635.0726 696.8213 717.2857 722.5553 755.2541 774.5798 782.9631 802.5555 829.9382 846.6702 882.8704 888.9630 898.0731 919.6422 954.8555 1005.2207 1017.7295 1042.4662 1048.2750 1051.3273 1059.6265 1097.6206 1121.8074 1141.2164 1160.3808 1191.1909 1226.8519 1229.8139 1248.4196 1274.5242 1286.2959 1294.6992 1312.8926 1315.9542 1342.6523 1366.8497 1375.9618 1406.9341 1427.2627 1438.8320 1449.8735 1470.4055 1472.4382 1619.7254 1642.4898 1670.5922 2988.0240 3011.6182 3016.7811 3056.1429 3069.0748 3070.6750 3082.5962 3096.6331 3101.5344 3107.3730 3175.2117 3524.7932
redmass: 3.7980 8.1539 5.7931 1.7108 1.7229 3.2782 4.8917 7.8091 5.3056 3.9248 3.8312 3.2734 6.9436 3.1690 3.6390 4.0966 6.0957 4.3721 6.3145 5.6755 4.1221 2.6400 3.9579 5.4135 6.8461 2.4932 2.4218 3.5231 2.6913 3.5206 3.6679 1.5396 2.6779 4.5718 2.1071 2.4572 1.8182 2.6232 1.8685 1.5378 1.9745 1.4213 2.5615 4.5685 1.6958 1.7310 3.5637 1.4931 1.5301 2.3149 1.2238 1.3166 1.4289 1.3415 2.1795 1.7505 2.0162 1.2577 2.4979 1.0987 1.0435 1.0933 1.0816 6.2703 8.9439 6.2422 1.0363 1.0569 1.0635 1.0860 1.0975 1.0894 1.1096 1.1005 1.1004 1.0932 1.0932 1.0769
irintensity: 0.7636 0.8768 0.2736 0.1716 0.7401 10.4129 2.2785 4.8322 5.3506 3.2366 3.8693 9.0936 19.3825 15.0112 5.2205 2.2469 8.9337 14.3204 11.0653 2.3343 5.0918 8.3477 6.8928 2.8070 10.4044 15.4242 103.0430 3.6100 10.7823 15.7570 6.6426 17.4985 76.5610 45.5489 21.0133 10.1164 20.4618 10.3068 15.6402 5.8754 80.7743 82.5492 10.4534 20.4113 46.7977 10.5943 23.5534 10.8538 7.2560 197.1450 6.3065 17.9313 23.5652 14.1741 63.6391 49.4250 14.7601 20.6462 71.3482 15.9871 11.7417 6.6581 3.5462 208.9059 275.8439 549.4863 21.5137 56.0220 9.5737 5.6975 12.5878 31.1332 14.8442 14.3045 6.3094 44.3104 3.3449 59.5839
temp: 298.150 k
press: 1.00000 atm
elementType: 8 8 8 8 7 7 6 6 6 6 6 6 6 6 6 6 1 1 1 1 1 1 1 1 1 1 1 1
symmnumber: 1
zpe: 568573.2 jmol-1
zpe.correction: 0.216558 hartree
zpe.thermalcorrener: 0.230631 hartree
zpe.thermalcorrenthalpy: 0.231575 hartree
zpe.thermalcorrgfe: 0.174555 hartree
zpe.sumelectzpe: -797.457615 hartree
zpe.sumelectthermal: -797.443542 hartree
zpe.sumelectthermalent: -797.442598 hartree
zpe.sumelectthermalfe: -797.499619 hartree
dipole: 3.1432 -4.3841 0.4110
dipole: 5.4101
quadrupole: -110.7081 -92.7513 -92.3846
quadrupole: -5.9818 -5.4174 -2.1510
quadrupole: -12.0934 5.8634 6.2300 -5.9818 -5.4174 -2.1510
hfenergy: -797.6741735 hartree
pointgroup: C01 [X(C10H12N2O4)]
dipole: -1.257696 -1.6337379 -0.5287418 debye
polarizability: 183.8967039|-7.8524043|123.8356945|-4.0727241|9.9334522|87.7409961 unknown
InChI: InChI=1S/C10H12N2O4/c1-5-3-12(10(14)11-9(5)13)8-2-6-7(16-8)4-15-6/h3,6-8,11H,2,4H2,1H3
charge 0 multiplicity 1
28 atoms
O  -1.609543 -0.775894 0.931198
O  -4.136383 0.509177 -0.493367
O  0.507504 2.544629 0.648495
O  4.46892 0.116598 0.138866
N  0.355695 0.259342 0.067547
N  2.458514 1.276507 0.383563
C  -3.138533 -0.53272 -0.956721
C  -2.979166 -1.070859 0.505513
C  -1.779056 0.066645 -1.325352
C  -1.108463 0.32144 0.052352
C  -4.057848 -0.03167 0.922113
C  1.01115 -0.951139 -0.18831
C  1.068181 1.444384 0.392906
C  2.3777 -1.090347 -0.186015
C  3.204857 0.091534 0.108924
C  3.082073 -2.397256 -0.451831
H  -3.584088 -1.186524 -1.722898
H  -3.17056 -2.128278 0.734054
H  -1.188439 -0.654697 -1.919778
H  -1.891586 0.997968 -1.903198
H  -1.38731 1.308014 0.460438
H  -5.026556 -0.458561 1.236849
H  -3.719676 0.737477 1.63847
H  0.346044 -1.801763 -0.355577
H  3.004186 2.115788 0.604712
H  3.773097 -2.301618 -1.308801
H  2.363503 -3.20749 -0.66309
H  3.70148 -2.690585 0.415037
